"id_1","pesiprov","pesireg","id","prov","prov2","b","c","d","e1","e2","e3","e4","e5","e6","e7","e8","e9","e10","e11","e12","d1","d2","d2b","d3","d4","d5","d6","d7","d8","d8b","d9","d10","d11","d12","d13","d14","d15","d15a","d15b","d15c","d15d","d16","d17","d18a","d18b","d18c","d18d","d18e","d18f","d18g","d19","d20","d21","d22","d23","d24_1","d24_2","d24_3","d24_4","d24_5","d24_99","d25_1","d25_2","d25_3","d25_4","d25_99","d26a1","d26a2","d26b1","d26b2","d26c1","d26c2","d27_1","d27_2","d27_3","d27_4","d27_5","d27_6","d27_7","d27_99","d28_1","d28_2","d28_3","d28_4","d28_5","d28_6","d28_7","d28_99","d29_1","d29_2","d29_3","d29_4","d29_5","d29_6","d29_7","d29_99","d30","d31","d32","d33a","d33b","d33c","d34_1","d34_2","d34_3","d34_4","d34_5","d34_6","d34_7","d35","areacitt","eta","tipo_lav","reddito","red_nec","grup_cit","gr_eta","gr_arrit","all_lav"
"120001","0.523923526","0.376666035","1","12","12","4","12034","8","1","0","0","0","1","1","1","1","0","0","1","1","2","1974","1","243","2002","2002","2002","1","3","4","3","4","5","99","5","11","1","1","0","0","0","-1","-1","100","-1","200","1","200","200","-1","7","99","99","150","750","1","0","0","0","0","0","1","0","0","0","0","-1","-1",,"100",,,"0","1","0","0","0","0","1","0","0","1","0","0","0","0","1","0","0","1","0","0","0","0","1","0","3","2","3","-1","5","3","3","1","5","5","5","4","5","3","1","4","150","750","-1","3","2","3","11"
"120002","0.921523032","0.662512911","2","12","12","4","12034","7","0","0","1","1","1","1","1","1","0","1","0","1","2","1973","1","608","1984","1984","1984","1","3","-1","2","3","2","1","2","-1","2","1","1","1","1","8","-1","120","300","50","2","-1","-1","1500","5","99","99","-1","450","1","0","0","0","0","0","1","0","0","0","0","-1","-1",,"100",,,"0","0","1","0","0","0","0","0","0","0","0","0","0","0","1","0","0","1","0","0","0","0","0","0","3","4","5","5","5","5","1","4","1","5","5","5","5","4","5","4",,"500","1500","5","2","1","-1"
"120003","1.229257667","0.88375363","3","12","12","4","12034","7","0","0","0","1","1","1","1","1","1","0","1","1","1","1969","1","436","2000","2000","2000","1","2","3","1","99","2","2","2","2","1","0","0","0","0","4","-1","-1","300","-1","3","-1","-1","2000","6","99","99","42","1400","1","0","0","0","0","0","1","0","0","0","0","-1","-1",,"100",,,"0","0","0","0","0","0","0","1","0","0","0","0","1","0","1","0","0","0","0","0","0","0","0","1","2","2","3","1","3","2","-1","-1","-1","-1","5","-1","5","4","3","5","40","1500","2000","3","2","2","77"
"120004","1.085916639","0.780701115","4","12","12","4","12034","6","0","0","1","1","0","1","1","1","1","0","1","1","1","1978","1","311","2000","2000","2000","2","2","4","6","99","2","2","1","2","1","0","0","0","0","2","1","350","350","-1","2","200","-1","1700","6","99","99","10","1300","0","0","1","0","0","0","1","0","0","0","0","-1","-1",,"100",,,"0","1","0","0","0","0","0","0","0","1","1","0","0","0","1","0","0","1","1","0","0","0","1","0","3","2","4","1","4","2","5","-1","-1","5","3","5","5","4","2","3","10","1500","2000","5","1","2","77"
"120005","0.94791031","0.681483385","5","12","12","4","12034","8","0","0","1","1","1","1","1","1","1","0","1","1","1","1977","1","460","2001","2001","2001","2","3","4","1","3","2","2","2","2","1","0","0","0","0","1","1","300","300","-1","-1","400","-1","2200","6","99","99","42","1400","1","0","0","0","0","0","0","0","1","0","0","-1","-1",,"100",,,"0","1","0","0","0","0","0","0","0","1","1","0","0","0","1","0","0","1","1","0","0","0","1","0","2","2","4","-1","3","2","-1","5","5","5","3","3","5","4","3","3","40","1500","2500","3","1","2","77"
"120006","0.525307498","0.377660319","6","12","12","4","12034","7","0","0","1","1","1","1","1","1","0","0","1","1","1","1979","1","330","2000","2000","2000","1","2","3","7","3","2","2","2","13","1","0","0","0","0","1","-1","-1","200","-1","-1","500","-1","-1","6","99","99","52","1200","1","0","0","0","0","0","1","0","0","0","0","-1","-1",,"100",,,"0","0","0","0","0","0","0","1","0","0","0","0","0","0","0","1","0","0","0","0","0","0","0","1","1","1","2","-1","2","1","-1","-1","-1","3","3","3","3","4","2","3","50","1500","-1","5","1","2","77"
"120007","1.15938342","0.833518216","7","12","12","4","12034","8","0","0","1","1","1","1","1","1","0","0","1","1","2","1970","1","609","1999","1999","1999","2","3","4","2","3","3","2","1","1","2","2","2","2","2","9","1","300","800","-1","4","50","-1","-1","6","99","99","170","1200","0","0","1","0","0","0","1","0","0","0","0","-1","-1",,"100",,,"0","1","0","1","0","0","1","0","0","0","0","0","0","1","1","0","0","1","0","1","0","0","0","0","3","3","4","3","5","3","5","3","5","5","5","4","5","4","5","5","170","1500","-1","5","2","2","77"
"120008","1.880703661","1.352099386","8","12","12","4","12034","7","0","0","0","0","1","1","1","0","0","0","0","1","1","1984","1","201","1998","1998","1998","1","2","1","3","4","1","2","1","2","1","0","0","0","0",,"-1","-1","250","-1","3","-1","-1","-1","6","99","99","42","1300","1","0","0","0","0","0","1","0","0","0","0","-1","-1",,"100",,,"0","0","0","0","0","0","0","1","0","0","0","0","0","0","0","1","0","0","0","0","0","0","0","1","2","2","2","1","2","1","-1","-1","-1","3","-1","-1","5","4","1","2","40","1500","-1","2","1","2","77"
"120009","0.525307498","0.377660319","9","12","12","4","12034","7","0","0","1","1","1","1","1","1","0","0","1","1","1","1982","1","330","2001","2001","2001","1","3","4","7","3","2","2","2","2","1","0","0","0","0","4","-1","-1","-1","-1","3","300","500","-1","6","99","99","52","1000","1","0","0","0","0","0","1","0","0","0","0","-1","-1",,"100",,,"0","0","0","0","0","0","0","1","0","0","0","0","0","0","0","1","0","0","0","0","0","0","0","1","1","1","2","1","2","1","-1","-1","-1","-1","5","3","5","4","2","2","50","1000","-1","5","1","2","77"
"120010","0.596349764","0.428735446","10","12","12","4","12034","7","0","0","1","1","1","1","1","1","1","0","1","1","1","1976","1","404","1999","1999","1999","1","4","4","2","2","2","2","2",,"1","0","0","0","0","7","-1","250","250","-1","1","200","-1","2000","6","99","99","41","1500","1","0","0","0","0","0","1","0","0","0","0","-1","-1",,"100",,,"0","1","1","0","0","0","1","0","0","1","1","0","0","1","1","0","0","1","1","0","0","1","1","0","3","3","5","3","5","3","5","5","5","5","5","5","5","4","4","4","40","1500","2000","5","2","2","77"
"120011","1.661237383","1.194317409","11","12","12","4","12034","6","0","0","0","0","1","1","1","0","1","0","0","1","1","1984","1","201","2001","2001","2005","1","2","4","3","4","2","2","2","2","1","0","0","0","0","4","-1","-1","200","-1","4","-1","-1","1500","4","99","99","42","1300","1","0","0","0","0","0","1","0","0","0","0","-1","-1",,"100",,,"0","0","0","0","0","0","0","1","0","0","0","0","0","0","1","0","0","0","0","0","0","0","0","1","1","1","2","1","2","1","-1","-1","-1","5","-1","3","3","4","1","2","40","1500","1500","2","1","2","77"
"120012","1.229257667","0.88375363","12","12","12","4","12034","7","0","0","0","1","1","1","1","1","1","0","1","1","1","1955","1","436","1994","1994","1994","2","3","3","1","99","1","2","2","2","1","3","0","0","0","4","1","-1","300","300","3","300","-1","2000","6","99","99","41","1500","1","0","0","0","0","0","1","0","0","0","0","-1","-1",,"100",,,"0","1","0","0","0","0","1","0","0","0","0","0","0","0","1","0","0","1","0","0","0","0","1","0","2","1","3","1","3","3","-1","-1","-1","-1","4","-1","4","4","3","8","40","1500","2000","3","3","1","77"
"120013","0.962810146","0.692195481","13","12","12","4","12034","7","0","0","1","1","1","1","1","1","0","0","1","1","1","1980","1","435","2000","2000","2000","-1","1","0","1","2","2","2","2","5","1","0","0","0","0","6","-1","-1","-1","-1","4","300","-1","-1","4","99","99","42","9999","1","0","0","0","0","0","1","0","0","0","0","-1","-1",,"100",,,"0","0","0","0","0","0","0","1","0","0","0","0","0","0","0","1","0","0","0","0","0","0","0","1","1","2","2","1","2","1","-1","-1","-1","4","4","3","4","4","4","3","40","9999","-1","5","1","2","77"
"120014","0.523923526","0.376666035","14","12","12","4","12034","7","0","0","0","1","1","1","1","1","0","0","1","0","2","1976","1","466","1998","1998","1998","2","3","4","3","4","1","1","1","2","2","2","2","2","2","9","1","300","350","-1","4","100","400","1700","5","99","99","102","600","0","1","0","0","0","0","1","0","0","0","0","-1","-1",,"100",,,"0","1","0","0","0","0","1","0","0","1","0","0","0","1","1","0","0","1","0","0","0","0","0","0","3","4","4","3","5","3","2","2","3","5","5","4","5","4","4","4","100","750","2000","5","2","2","77"
"120015","1.58361775","1.13851458","15","12","12","4","12034","7","0","0","0","1","0","1","1","1","0","0","0","1","2","1984","1","344","2003","2003","2003","2","2","3","1","3","2","1","1","2","2","1","1","1","1","9","1","300","-1","3","-1","-1","-1","3","-1","99","99","-1","-1","0","1","0","0","0","0","0","0","0","1","0","-1","-1",,"100",,,"0","1","1","0","0","0","0","0","0","0","1","0","0","0","1","0","0","1","1","0","0","0","0","0","2","3","2","2","-1","2","1","1","3","5","5","3","4","4","2","2",,"-1","1000","5","1","3","77"
"120016","2.350447731","1.689813654","16","12","12","4","12118","7","1","0","0","1","0","1","1","1","0","0","1","1","2","1973","1","436","1999","1999","1999","2","3","3","1","4","1","1","1","2","2","2","2","2","2","9","1","400","600","100","4","100","-1","1700","3","99","99","-1","-1","1","0","0","0","0","0","0","0","0","1","0","-1","-1",,"100",,,"0","1","0","0","0","0","1","0","0","1","0","0","0","0","1","0","0","1","0","0","0","0","1","0","4","3","3","3","-1","4","5","1","3","5","5","3","5","4","3","4",,"-1","2000","3","2","2","77"
"120017","1.500322601","1.078631091","17","12","12","4","12118","7","0","0","0","1","1","1","1","0","1","0","0","1","1","1980","1","201","2001","2001","2001","1","2","3","1","4","2","2","2","6","1","0","0","0","0","7","-1","-1","200","-1","1","-1","-1","-1","6","99","99","41","1500","1","0","0","0","0","0","1","0","0","0","0","-1","-1",,"100",,,"0","1","0","0","0","0","1","0","0","1","1","0","0","0","1","0","0","1","1","0","0","0","1","0","3","2","4","1","3","3","5","5","-1","5","-1","5","5","4","1","3","40","1500","-1","2","1","2","77"
"120018","0.747767406","0.537594061","18","12","12","4","12118","7","1","0","1","1","1","1","1","1","0","0","1","1","2","1970","1","404","1994","1994","1994","2","3","4","2","3","6","99","1","2","2","2","2","2","2","10","1","500","650","-1","6","100","-1","1800","6","99","99","10","1000","0","1","0","0","0","0","1","0","0","0","0","-1","-1",,"100",,,"0","1","0","0","0","0","1","0","0","0","0","0","0","1","1","0","0","1","0","0","0","0","1","0","3","3","4","4","5","3","5","5","5","5","5","4","5","4","4","5","10","1000","2000","5","2","1","77"
"120019","0.924134384","0.664390044","19","12","12","4","12118","7","1","0","1","1","1","1","1","1","0","1","1","0","2","1966","1","615","1998","2001","2001","4","4","1","2","3","2","2","2","2","1","1","0","0","0","4","-1","500","650","150","2","200","-1","2000","6","99","99","150","800","0","0","0","1","0","0","1","0","0","0","0","-1","-1",,"100",,,"0","1","0","1","0","0","0","0","0","0","0","0","1","1","0","0","0","1","0","1","1","0","0","0","4","3","4","5","5","3","3","4","5","5","4","4","4","4","5","6","150","1000","2000","5","3","2","77"
"120020","0.789831436","0.567835242","20","12","12","4","12118","7","1","0","1","0","1","1","1","1","1","0","1","1","1","1974","1","235","1997","1997","1997","2","3","4","2","3","1","2","2","2","2","1","1","1","1","10","1","600","500","-1","4","150","-1","2200","6","99","99","41","1700","0","0","1","0","0","0","1","0","0","0","0","-1","-1",,"100",,,"0","1","0","0","0","0","0","0","0","1","0","0","0","0","1","0","0","1","0","0","0","0","0","0","3","2","4","1","4","3","5","5","5","5","3","5","5","4","1","4","40","2500","2500","4","2","1","77"
"120021","1.285904748","0.924479004","21","12","12","4","12075","8","0","0","1","1","0","1","0","1","0","0","0","1","1","1956","1","344","1989","1989","1989","2","3","3","1","2","6","99","1","2","2","2","2","2","2","9","2","500","300","-1","4","-1","-1","2500","4","99","99","42","1200","1","0","0","0","0","0","1","0","0","0","0","-1","-1",,"100",,,"0","1","0","1","0","0","0","0","0","0","0","0","0","0","1","0","0","1","0","0","0","0","1","0","3","2","3","3","3","3","5","5","5","5","5","5","5","4","2","8","40","1500","2500","5","3","1","77"
"120022","2.215689712","1.592931736","22","12","12","4","12075","5","0","0","0","1","1","1","1","1","1","0","1","1","1","1973","1","609","1999","1999","1999","2","99","0","-1","3","2","2","1","2","2","2","2","2","2","9","1","450","450","-1","5","100","-1","2000","6","99","99","10","1400","0","0","1","0","0","0","1","0","0","0","0","-1","-1",,"100",,,"0","0","0","0","0","0","0","1","0","1","1","0","0","0","1","0","0","0","0","0","0","0","0","1","2","3","3","1","3","2","5","-1","-1","5","3","5","5","4","5","4","10","1500","2000","5","2","2","77"
"120023","1.500322601","1.078631091","23","12","12","4","12075","6","0","0","0","1","1","1","1","0","1","0","0","1","1","1983","1","201","1999","1999","1999","1","3","3","-1","4","2","2","2","2","1","0","0","0","0","4","-1","-1","500","-1","2","-1","-1","2000","4","99","99","42","1200","1","0","0","0","0","0","1","0","0","0","0","-1","-1",,"100",,,"0","1","0","0","0","0","1","0","0","1","1","0","0","0","1","0","0","0","0","0","0","0","0","1","2","2","3","1","3","2","-1","-1","-1","5","-1","-1","5","4","1","2","40","1500","2000","2","1","2","77"
"120024","1.112057649","0.799494731","24","12","12","4","12075","6","1","0","0","0","1","1","1","0","1","0","1","1","1","1977","1","201","1994","1994","1994","2","2","3","1","4","1","2","3","2","2","1","1","1","1","10","1","500","400","-1","4","-1","-1","2000","6","99","99","41","1700","0","0","1","0","0","0","1","0","0","0","0","-1","-1",,"100",,,"0","1","0","0","0","0","0","0","0","1","1","0","0","0","1","0","0","1","0","0","0","0","0","0","2","2","3","1","3","2","3","3","3","5","3","5","5","4","1","3","40","2500","2000","2","1","1","77"
"120025","1.34368954","0.966022523","25","12","12","4","12075","8","0","0","0","1","1","1","1","1","0","0","0","1","2","1984","1","344","1998","1998","1998","1","2","1","1","3","2","1","1","2","1","0","0","0","0","4","-1","-1","400","-1","5","-1","-1","-1","1","99","99","-1","-1","0","1","0","0","0","0","0","0","0","0","1","-1","-1",,"100",,,"0","1","0","0","0","0","0","0","0","0","1","0","0","1","1","0","0","1","0","0","0","0","1","0","2","3","4","1","-1","3","2","2","2","4","5","4","5","4","2","2",,"-1","-1","5","1","2","77"
"120026","0.523923526","0.376666035","26","12","12","4","12075","8","1","0","0","1","0","1","1","1","0","0","1","0","2","1964","1","314","1998","1998","1998","2","3","3","6","99","2","3","2","2","1","2","2","2","0","9","1","300","400","-1","4","50","-1","2000","10","3","5","90","-1","0","1","1","0","0","0","1","0","0","0","0","-1","-1",,"100",,,"0","1","0","0","0","0","0","0","0","0","0","0","0","1","1","0","0","1","0","0","0","0","0","0","2","3","4","1","5","3","2","3","2","5","5","3","5","4","2","6","90","-1","2000","5","3","2","77"
"120027","1.765745368","1.269451615","27","12","12","4","12075","8","0","0","1","1","0","1","1","1","0","0","0","0","2","1980","1","450","2002","2002","2002","2","2","3","1","3","2","1","1","2","2","1","1","1","1","9","1","300","400","-1","3","100","-1","1500","3","99","99","-1","-1","0","1","0","0","0","0","0","0","0","1","0","-1","-1",,"100",,,"0","1","0","0","0","0","1","0","0","1","1","0","0","0","1","0","0","1","1","0","0","0","1","0","2","3","3","2","-1","3","2","2","2","4","5","3","5","4","4","3",,"-1","1500","5","1","3","77"
"120028","0.752083728","0.540697693","28","12","12","4","12075","8","1","0","1","1","0","1","1","1","0","0","1","1","2","1978","1","323","2000","2000","2000","1","3","3","2","2","3","2","2","6","1","0","0","0","0","7","-1","200","200","150","1","150","-1","-1","6","99","99","60","750","0","0","0","1","1","0","1","0","0","0","0","-1","-1",,"100",,,"0","1","0","0","0","0","1","0","0","0","1","0","0","1","1","0","0","1","0","0","0","0","0","0","3","2","3","1","5","2","3","1","4","5","5","3","5","4","2","3","60","750","-1","5","1","2","77"
"120029","1.219913758","0.877035924","29","12","12","4","12075","8","0","0","1","1","1","1","1","1","1","0","1","1","1","1981","1","436","2001","2001","2001","2","2","4","1","1","2","2","2","2","1","0","0","0","0",,"1","300","200","-1","3","300","-1","2000","4","99","99","10","1300","1","0","0","0","0","0","0","0","1","0","0","-1","-1",,"100",,,"0","1","1","0","0","0","0","0","0","1","1","0","0","0","1","0","0","1","1","0","0","0","1","0","2","2","2","1","2","2","-1","-1","5","5","5","-1","5","4","3","3","10","1500","2000","3","1","2","77"
"120030","0.978137429","0.703214561","30","12","12","4","12075","7","1","0","1","1","1","1","1","1","0","0","0","1","2","1963","1","615","1992","1992","1992","2","3","3","2","2","6","99","1","2","2","1","1","1","1","9","2","400","900","200","3","-1","-1","3000","5","99","99","20","400","1","0","0","0","0","0","1","0","0","0","0","-1","-1",,"100",,,"0","1","0","0","0","1","0","0","0","0","0","0","0","1","1","0","0","1","0","0","0","1","0","0","4","3","4","5","5","4","4","4","1","5","5","4","5","4","5","6","20","500","3500","5","3","1","77"
"120031","1.184736018","0.851745314","31","12","12","4","12119","7","1","0","0","0","1","1","1","0","1","0","0","1","1","1975","1","201","1995","1995","1995","2","3","3","1","4","1","2","3","2","1","0","0","0","0","4","1","-1","200","-1","3","-1","700","2000","6","99","99","41","1600","1","0","0","0","0","0","0","0","1","0","0","-1","-1",,"100",,,"1","0","0","0","0","0","0","0","0","0","1","0","0","0","1","0","0","0","0","0","0","0","0","1","2","1","3","1","3","1","-1","-1","-1","5","4","5","5","4","1","4","40","2500","2000","2","2","1","77"
"120032","1.184736018","0.851745314","32","12","12","4","12119","7","1","0","0","0","1","1","1","0","1","0","0","1","1","1980","1","201","1997","1997","1997","1","3","3","1","4","2","2","3","2","1","0","0","0","0","4","-1","-1","200","-1","3","-1","500","2000","6","99","99","42","1300","1","0","0","0","0","0","1","0","0","0","0","-1","-1",,"100",,,"0","0","0","0","0","0","0","1","0","0","1","1","0","0","1","0","0","0","0","0","0","0","0","1","2","1","2","1","3","2","-1","-1","-1","5","3","-1","5","4","1","3","40","1500","2000","2","1","1","77"
"120033","1.90426685","1.369039594","33","12","12","4","12119","7","0","0","0","0","1","1","1","1","0","1","1","1","2","1980","1","201","1998","1998","1998","1","3","4","3","4","2","2","1","6","1","0","0","0","0","7","-1","200","300","200","1","100","-1","2000","-1","99","99","81","1000","1","0","0","0","0","0","1","0","0","0","0","-1","-1",,"100",,,"0","1","0","0","0","0","0","0","0","1","0","0","0","1","1","0","0","1","0","0","0","0","0","0","3","4","4","2","5","3","1","5","5","5","5","3","5","4","1","3","80","1000","2000","2","1","2","77"
"120034","0.640210707","0.460268548","34","12","12","4","12119","8","0","1","0","1","1","0","1","1","0","0","1","1","2","1982","1","235","2003","2003","2003","1","3","2","3","4","5","99","5","11","1","0","0","0","0","1","-1","150","-1","200","1","200","200","-1","7","99","99","130","750","1","0","0","0","0","0","1","0","0","0","0","-1","-1",,"100",,,"0","1","0","0","0","0","0","0","0","1","0","0","0","0","1","0","0","1","0","0","0","0","0","0","2","3","3","-1","5","2","3","3","5","5","5","4","5","2","1","2","130","750","-1","4","1","3","11"
"120035","0.523923526","0.376666035","35","12","12","4","12119","8","1","1","0","1","1","1","1","1","0","0","1","0","2","1954","1","243","2002","2002","2002","4","3","4","3","3","5","99","5","11","1","2","0","0","0","1","-1","100","-1","150","1","200","300","-1","7","99","99","150","800","1","0","0","0","0","0","1","0","0","0","0","-1","-1",,"100",,,"0","1","0","0","0","0","0","0","0","0","0","0","0","0","1","0","0","1","0","0","0","0","0","0","2","2","3","-1","5","1","2","3","5","5","5","3","5","1","1","8","150","1000","-1","3","3","3","11"
"120036","0.523923526","0.376666035","36","12","12","4","12119","6","1","0","1","1","0","1","1","1","0","0","0","1","2","1976","1","409","2000","2000","2000","2","2","3","1","1","3","3","1","1","2","2","2","2","2","10","1","400","650","-1","6","-1","-1","1800","7","99","99","140","400","0","1","0","0","0","0","1","0","0","0","0","-1","-1",,"100",,,"0","1","0","0","0","0","1","0","0","1","1","0","0","0","1","0","0","1","0","0","0","0","1","0","3","3","3","1","5","3","1","3","3","5","5","3","5","4","4","4","140","500","2000","5","2","2","77"
"120037","0.924134384","0.664390044","37","12","12","4","12119","7","1","0","1","1","1","1","1","1","0","1","1","1","2","1969","1","615","1993","1993","1993","2","4","3","2","3","6","99","2","1","2","1","1","1","1","9","2","300","300","300","3","100","-1","2500","5","99","99","20","580","0","0","1","0","1","0","0","0","0","1","0","-1","-1",,"100",,,"0","1","0","0","0","0","0","0","0","0","0","0","0","0","1","0","0","1","0","0","0","0","0","0","3","3","4","3","4","3","5","4","4","4","4","4","5","4","5","5","20","750","2500","5","2","1","77"
"120038","2.096873507","1.507511043","38","12","12","4","12119","8","1","1","1","1","0","1","1","1","0","0","0","1","2","1984","1","436","2003","2003","2003","2","2","3","1","2","2","1","1","2","2","2","2","2","2","9","1","300","600","-1","4","-1","-1","1500","3","99","99","-1","-1","0","1","0","0","0","0","1","0","0","0","0","-1","-1",,"100",,,"0","1","1","0","0","0","0","0","0","1","1","0","0","0","0","0","0","1","1","0","0","0","0","0","2","2","3","3","5","2","2","3","5","5","5","3","5","4","3","2",,"-1","1500","3","1","3","77"
"120039","0.523923526","0.376666035","39","12","12","4","12119","8","1","0","1","1","0","1","1","1","0","1","0","1","2","1969","1","418","1994","1994","1994","2","2","4","2","2","1","1","1","2","2","2","2","2","2","9","1","350","600","200","4","-1","-1","2000","3","99","99","-1","-1","0","1","0","1","0","0","1","0","0","0","0","-1","-1",,"100",,,"0","1","0","0","0","0","0","0","0","1","0","0","0","1","1","0","0","1","0","0","0","0","0","0","3","3","4","2","-1","3","1","1","3","5","5","4","5","4","4","5",,"-1","2000","5","2","1","77"
"120040","1.627790943","1.170271989","40","12","12","4","12127","6","1","0","0","1","1","1","1","1","1","0","1","1","1","1966","1","337","1987","1987","1987","4","3","4","5","4","1","2","1","2","1","2","0","0","0","1","-1","-1","350","-1","1","200","-1","2000","6","99","99","10","1400","0","0","1","0","0","0","1","0","0","0","0","-1","-1",,"100",,,"0","1","0","0","0","0","1","0","0","1","1","0","0","0","1","0","0","1","1","0","0","0","1","0","3","3","5","-1","5","4","5","5","5","5","5","5","5","4","2","6","10","1500","2000","3","3","1","77"
"120041","1.104334789","0.793942415","41","12","12","4","12127","7","1","0","1","0","1","1","1","0","1","0","1","1","1","1972","1","201","1994","1994","1994","1","3","4","2","2","1","1","1","2","1","0","0","0","0","1","-1","500","350","-1","1","200","-1","2000","6","99","99","41","1700","1","0","0","0","0","0","1","0","0","0","0","-1","-1",,"100",,,"0","1","0","1","0","0","0","0","0","1","1","0","0","0","1","0","0","1","0","1","0","0","0","0","3","2","5","-1","5","3","5","5","5","5","5","5","5","4","1","4","40","2500","2000","2","2","1","77"
"120042","2.263784431","1.62750808","42","12","12","4","12127","8","0","0","1","1","0","1","0","1","1","0","1","0","1","1967","1","436","1998","1998","1998","2","3","4","1","2","2","2","1","6","1","2","0","0","0","7","1","250","10","-1","2","500","-1","1800","4","99","99","42","1300","1","0","0","0","0","0","0","0","0","0","1","-1","-1",,"100",,,"1","0","0","0","0","0","0","0","0","0","1","0","0","0","1","0","0","0","0","0","0","0","0","1","1","1","2","1","3","1","-1","-1","-1","-1","4","-1","4","4","3","5","40","1500","2000","3","2","2","77"