"anno","cognome","nome","struttura","contratto","numero_atto","link_curriculum","retribuzione_fondamentale","retribuzione_di_posizione","retribuzione_di_risultato","altre_cariche_incarichi_presso","importi_di_viaggi_e_missioni","dichiarazione_stato_patrimoniale","copia_dichiarazione_stato_patrimoniale","anno_termine_incarico","dichiarazione_redditi","_copia_dichiarazione_redditi_riferiti_al_periodo_dell_incarico","dichiarazione_negato_consenso","copia_dichiarazione_negato_consenso_del_coniuge_e_dei_parenti_entro_il_secondo_grado","note_"
"2018","Lentini","Antonio","STRUTTURA AREA ECONOMICA, COORDINAMENTO STATISTICA","RUOLO","https://drive.google.com/drive/folders/1-5pBC_gilJdBrvqr9EGjMYtdv5I8NkzD?usp=sharing","https://drive.google.com/file/d/1V0XimjRsPXbR85ZJSPHVlU9zB_R6HBNd/view?usp=sharing","11.201,52","11.416,45","15.971,67","https://drive.google.com/file/d/1KSa8PBCaIlNz4WYWzvsPyxCT_jaY-ndi/view?usp=sharing","16736","N.A. per Decreto direttoriale 158/2020",,"31/3/2018","N.A. per Decreto direttoriale 158/2020",,"N.A. per Decreto direttoriale 158/2020",,
"2018","Meletti","Cesare","U.O. DIREZIONE AMMINISTRATIVA","RUOLO","https://drive.google.com/drive/folders/1-5pBC_gilJdBrvqr9EGjMYtdv5I8NkzD?usp=sharing","https://drive.google.com/file/d/1ESlL068BexkRjCqch-hf0MeIZPSgvm4g/view?usp=sharing","69.644,79","0","18.299,22","https://drive.google.com/file/d/1lHHKk5ODf2RFF2jQ207zx5w0LyrgAK-p/view?usp=sharing","0",," (https://drive.google.com/file/d/1oPW04VGH15liACW7Hd6_wqMgpeyTsv4p/view?usp=sharing)","30/6/2018","-"," (https://drive.google.com/file/d/1RML5-9Y6XgL2yAr1Ag2yRHbjbg0eShL8/view?usp=sharing)",," (https://drive.google.com/file/d/1MDkTXPZ5wA6hDvamF0NC92OOXO0zlfrj/view?usp=sharing)",
"2019","Pinna","Paolo","STRUTTURA FORMAZIONE PER LE POLITICHE SETTORIALI SOCIALI, ECONOMICHE E TERRITORIALI","RUOLO","https://drive.google.com/drive/folders/1A65Gbq8UCIytl8pbLtVlqBrWeF1dTP7T?usp=sharing","https://drive.google.com/file/d/15VFoJKp_Y7zfVgV1i2mW_zI7Wb9NLMi-/view?usp=sharing","25.518,75","17.576,82","11.756,87","https://drive.google.com/file/d/1qJDwtle9MflduYL8IKCr7rOilUXvlFBo/view?usp=sharing","54029","N.A. per Decreto direttoriale 158/2020",,"31/7/2019","N.A. per Decreto direttoriale 158/2020",,"N.A. per Decreto direttoriale 158/2020",,
"2019","Pinna","Paolo","STRUTTURA FORMAZIONE PER LE POLITICHE SETTORIALI SOCIALI, ECONOMICHE E TERRITORIALI","RUOLO","https://drive.google.com/drive/folders/1A65Gbq8UCIytl8pbLtVlqBrWeF1dTP7T?usp=sharing","https://drive.google.com/file/d/15VFoJKp_Y7zfVgV1i2mW_zI7Wb9NLMi-/view?usp=sharing",,,"4.225,00","https://drive.google.com/file/d/1qJDwtle9MflduYL8IKCr7rOilUXvlFBo/view?usp=sharing",,"N.A. per Decreto direttoriale 158/2020",,"31/7/2019","N.A. per Decreto direttoriale 158/2020",,"N.A. per Decreto direttoriale 158/2020",,
"2019","Bianchessi","Carlo","U.O. LAVORO","RUOLO","https://drive.google.com/drive/folders/1A65Gbq8UCIytl8pbLtVlqBrWeF1dTP7T?usp=sharing","https://drive.google.com/file/d/1QO3Xyaigpdj2h7KbJPcQigUe1RanDH-3/view?usp=sharing","43.830,87","37.743,55","15.412,54","https://drive.google.com/file/d/1e61yp-HZdrv08InuPCfBHx7buuZNQBxZ/view?usp=sharing",,"N.A. per Decreto direttoriale 158/2020",,"31/12/2019","N.A. per Decreto direttoriale 158/2020",,"N.A. per Decreto direttoriale 158/2020",,"Trasferito presso altro Ente dal 01/01/2020"
"2019","Bianchessi","Carlo","STRUTTURA AMMORTIZZATORI SOCIALI","RUOLO","https://drive.google.com/drive/folders/1A65Gbq8UCIytl8pbLtVlqBrWeF1dTP7T?usp=sharing","https://drive.google.com/file/d/1QO3Xyaigpdj2h7KbJPcQigUe1RanDH-3/view?usp=sharing",,,"4.915,41","https://drive.google.com/file/d/1e61yp-HZdrv08InuPCfBHx7buuZNQBxZ/view?usp=sharing","10406","N.A. per Decreto direttoriale 158/2020",,"31/12/2019","N.A. per Decreto direttoriale 158/2020",,"N.A. per Decreto direttoriale 158/2020",,"Trasferito presso altro Ente dal 01/01/2020"
"2021","De Crinito","Armando","U.O. COORDINAMENTO ATTIVITA' DI RICERCA, FORMAZIONE E STATISTICA","RUOLO","https://drive.google.com/drive/u/0/folders/1QW2SBuruTioFOX4TtwVpd0p7rcxnivwc","https://drive.google.com/file/d/12PwnWIfH9tfCAMgV4Ehuo0D7d51rD-MD/view?usp=sharing","13.216,93",,"23.700,00","https://drive.google.com/file/d/1X9uASCKf5jI41qlR3wZfRj1RxtbeqoDs/view?usp=sharing",,," (https://drive.google.com/file/d/1wdKxwRFz5oXd-w32NlGBiJuCqxF6L0nX/view?usp=sharing)","31/1/2021","-"," (https://drive.google.com/file/d/1Vvnggy70-TjoG9_ZdgBbFBDn4VPHLOkF/view?usp=sharing)",," (https://drive.google.com/file/d/13I30zj-cXfFs_TOWGuz3S-kgYsLsd2DM/view?usp=sharing)","DGR n. 4222 del 25 gennaio 2021"
"2021","De Crinito","Armando","STRUTTURA STATISTICA","RUOLO","https://drive.google.com/drive/u/0/folders/1QW2SBuruTioFOX4TtwVpd0p7rcxnivwc","https://drive.google.com/file/d/12PwnWIfH9tfCAMgV4Ehuo0D7d51rD-MD/view?usp=sharing",,,,"https://drive.google.com/file/d/1X9uASCKf5jI41qlR3wZfRj1RxtbeqoDs/view?usp=sharing",,"."," (https://drive.google.com/file/d/1oPW04VGH15liACW7Hd6_wqMgpeyTsv4p/view?usp=sharing)","31/1/2021","-"," (https://drive.google.com/file/d/1Vvnggy70-TjoG9_ZdgBbFBDn4VPHLOkF/view?usp=sharing)",," (https://drive.google.com/file/d/13I30zj-cXfFs_TOWGuz3S-kgYsLsd2DM/view?usp=sharing)","DGR n. 4222 del 25 gennaio 2021"
"2022","Montaletti","Giampaolo","U. O. SUPPORTO ALLE POLITICHE E SISTEMI INFORMATIVI","NON RUOLO","https://drive.google.com/drive/folders/15lynE5wl9FTcgWTe7qoJfrk1SLpsFEkR?usp=sharing","https://drive.google.com/file/d/1El4Uj5MYLc2uRGcx4-YtY88uE8zMhCzs/view?usp=sharing","7.578,45","7.669,43","20.292,83","https://drive.google.com/file/d/1k9br0rHVnsAaN-QX97dBPfMynoRM2DzT/view?usp=sharing",,"N.A. per Decreto direttoriale 158/2020",,"28/2/2022","N.A. per Decreto direttoriale 158/2020",,"N.A. per Decreto direttoriale 158/2020",,
"2023","Terreno","Gregorio","STRUTTURA CONTROLLI SVILUPPO CAPITALE UMANO E COMUNICAZIONE","RUOLO",,"https://drive.google.com/file/d/1WIYnxMVCyxshRVMHelp0yrH5eXbj9P21/view?usp=drive_link","15.494,26","12.717,68","16.304,74","https://drive.google.com/file/d/1u4hh3NzOPMjvQVUAMhKPvydd5YTOVqQQ/view?usp=drive_link",,"N.A. per Decreto direttoriale 158/2020",,"31/3/2023","N.A. per Decreto direttoriale 158/2020",,"N.A. per Decreto direttoriale 158/2020",,"Dimissioni per collocamento a riposo dal 1° aprile 2023"
"2023","Marchetti","Maria Rosa","U.O. SISTEMI INFORMATIVI","RUOLO  IN COMANDO","https://drive.google.com/file/d/1rp9it40QJeX1EG8wzerqF9D9mq5Dt46x/view?usp=drive_link","https://drive.google.com/file/d/1DxCNqfeP8UuiBRx3qCoYXdkUm0iYHTYL/view?usp=drive_link","25.014,13","24.820,77","19.167,25","https://drive.google.com/file/d/1FKntcYyyvlNDOYKTXdQUjgyb1EBLlU1C/view?usp=drive_link",,"N.A. per Decreto direttoriale 158/2020",,"14/7/2023","N.A. per Decreto direttoriale 158/2020",,"N.A. per Decreto direttoriale 158/2020",,"Cessazione anticipata del comando il 14 luglio 2023  - DGR n. 628 del 13/07/2023"
