"caso","pesiprov","pesireg","prov","prov2","nquest","codcom","genere","nascita","cittad","statciv","rel","titstud","titstudr","permsog","bosfi1","bosfireg","bosfies","permsog2","lav1","lavpae","lav2","arr_ita","arr_lomb","arr_prov","anagr","casa","conv1","conv2","figli1","figli2","figli3","figli4","spesa1","spesa2","spesa3","spesa4","spesa5","nucleo","red","beni1","beni2","beni3","beni4","beni5","beni6","beni7","lavoro","lavoro2","reddito","salute1","sal2_1","sal2_2","sal2_3","sal2_4","sal2_5","sal2_6","sal2_7","sal2_8","sal3_1","sal3_2","sal3_3","sal3_4","sal3_5","sal3_6","sal3_7","sal3_8","sal4","sal4_2","bad1","bad2","bad3","bad4_1","bad4_2","bad4_3","bad4_4","bad4_5","bad4_6","bad4_7","cl_eta","arr_itar","arr_lomr","arr_pror","area","figli1r","figli2r","figli3r","figli4r","cla_red","sp_tot","spesatr","sp1r","sp2r","sp3r","sp4r","sp5r","arr_it","pds","lavoro_r","lav2_r","cla_redz","ita_r","attivi","arrit"
"1","0.45678124277459387","0.4111031184971345","16","16","1","16037","1","1965","401","4","7","2","2","2","2",,,"2","2",,,"1995","1998","1998","3","6","7",,"2","2","0","0","200","200","100","99","99","1","3000",,"2",,,,,,"4","106","550","9",,,,,,,"7",,,,,,,,,,"5",,"2",,,,,,,,,,"5","3","4","4","4","2","2","0","2","3",,,"3","3","2",,,"2","2","4","10","3","2","1","2"
"2","1.0761545212169632","0.968539069095267","16","16","2","16037","2","1969","460","1","2","2","2","2","2",,,"2","2",,,"1988","1991","1995","2","6","7",,,,,,"200","250","150",,,"1","3000",,"2",,,,,,"4","104","800","4","1",,"3",,,,,,"1",,"3",,,,,,"1","6","2",,,,,,,,,,"5","1","2","3","4",,,,,"4",,,"3","3","2",,,"1","2","4","10","4","1","1","1"
"3","3.0097373144004465","2.7087635829604015","16","16","3","16037","2","1976","436","2","2","3","5","2","2",,,"1","2",,,"2001","2001","2001","2","2","2",,,,,,"400","400","200","99","0","2","3000","1",,"3",,,,,"3",,,"4","1",,"3","4",,,,,"1","2",,,,,,,"2","5","2",,,,,,,,,,"3","7","7","7","4",,,,,,,,"4","4","3",,"0","3","2","3",,,"3","2","3"
"4","0.7244077367697768","0.651966963092799","16","16","4","16037","2","1970","404","2","1","3","3","2","2",,,"1","2",,,"1996","1998","1998","1","2",,"9","4","4","4","4","850","450","99","50","99","6","2000","1",,"3",,,,,"7","15","200","9","1","2",,"4",,,,,"1","2",,,,,,,"8",,"1","4","3","1","2","3",,,,,"4","4","4","4","5","4","4","4","4","1",,"5","5","4",,"1",,"3","2","5","15","1","3","1","3"
"5","0.578132082595336","0.5203188743358024","16","16","5","16037","1","1986","201","1","7","2","2","2","2",,,"2","2",,,"2000","2002","2002","2","6","7",,"0",,,,"150","100","100","100","99","1","99",,"2",,,,,,"4","105","550","9",,,,,,,"7",,,,,,,,,,"8",,"2",,,,,,,,,,"1","6","8","8","1","0",,,,"3","450","4","2","2","2","2",,"3","2","4","10","3","3","1","3"
"6","1.5840722707370773","1.4256650436633693","16","16","6","16037","1","1965","453","2",,"3","3","2","2",,,"2","2",,,"1995","1995","1995","2","2",,"9","2","2","2","2","300","450","150","50","99","4","3000","1","2","3",,,,,"6","2","900","9",,,,,,,"7",,,,,,,,,,"8",,"1","6","1",,,,,,,,"5","3","3","3","5","2","2","2","2","4","950","5","3","4","2","1",,"2","2","4","2","4","2","1","2"
"7","0.844091692047403","0.7596825228426626","16","16","7","16037","2","1970","453","2","2","3","3","2","2",,,"1","2",,,"1997","1998","1998","2","2",,"9","2","2","2","2","300","450","150","50","99","4","3000","1","2","3",,,,,"7","17","200","5",,"2",,,,,,,"1",,,,,,,,"8",,"1","3","3",,"2",,,"5",,,"4","4","4","4","5","2","2","2","2","1","950","5","3","4","2","1",,"3","2","5","17","1","3","1","3"
"8","0.844091692047403","0.7596825228426626","16","16","8","16037","1","1969","323","2","99","2","2","2",,,,"3","2",,,"2000","2002","2002","1","6","7",,"2","0","0","0","150","100","50","150","50","1","99",,"2",,,,,,"10","92",,"9",,,,,,,"7",,,,,,,,,,"8",,"1","6","1",,,,,,,,"5","6","8","8","2","2","0","0","0",,"450","4","2","2","1","2","1","3","2","7","9",,"3","1","3"
"9","1.453444131976243","1.3080997187786187","16","16","9","16037","2","1960","436","2","2",,,"1","2",,,,"1","239","1994","1995","1999","2000","3","1",,"9","2","2","2","2","450","250","100","150","100","4","2000","1",,,,,,,"3",,,"4",,"2",,,,,,,"1",,,,,,,,"8",,"1","4","1",,,,,,,,"6","3","5","6","4","2","2","2","2",,"950","5","4","3","2","2","2","2","1","3",,,"2","2","2"
"10","1.5372514941735824","1.383526344756224","16","16","10","16037","1","1960","460","2","2","3","3","3",,,,,"2",,,"1990","1993","1993","3","1",,"9","2","2","2","2","450","250","100","150","100","4","2000","1",,,,,,,"6","101","2000","9",,"2",,,,,,,"1",,,,,,,,"8",,"2",,,,,,,,,,"6","2","3","3","4","2","2","2","2","6","950","5","4","3","2","2","2","2","1","4","10","6","2","1","2"
"11","0.5606005510464283","0.5045404959417854","16","16","11","16051","1","1957","201","2","1","4","4","2","2",,,"2","2",,,"1999","1999","2000","1","2",,"9","1","1","1","1","400","400","80","100","50","3","2000","1","2","3",,,,,"6","63","750","4",,"2",,,,,,,"1",,,,,,,,"8",,"1","6","1",,,,,,,,"7","5","5","6","1","1","1","1","1","4","980","5","4","4","2","2","1","3","2","4","6","4","3","1","3"
"12","0.5064550152284417","0.4558095137055975","16","16","12","16051","2","1970","201","2","1","4","4","2","2",,,"1","2",,,"2000","2000","2000","1","2",,"9","1","1","1","1","400","400","80","100","50","3","2000","1","2","3",,,,,"7","15","200","4","1","2",,,,,,,"1",,,,,,,,"8",,"1","4","1","1",,"3",,,,,"4","6","6","6","1","1","1","1","1","1","980","5","4","4","2","2","1","3","2","5","15","1","3","1","3"
"13","1.6037742148900656","1.443396793401059","16","16","13","16051","2","1954","436","2","2","3","3","2","2",,,"2","1","215","1992","1992","1994","1994","1","11",,,"2","0","0","0","200",,"100","100","50",,"99",,,,,,,,"4","16","950","5",,,"3",,,"6",,,,"2",,,,,,,"8",,"1","1","1","1","2","3",,"5",,,"8","2","3","3","4","2","0","0","0","4",,,"3",,"2","2","1","2","2","4","16","4","2","1","2"
"14","1.1330744716321846","1.019767024468966","16","16","14","16051","2","1975","460","4","2","3","3","2","2",,,"1","2",,,,,,"3","6",,"14","2","2","2","2","350","180","50","50","99","3","2500",,"2",,,,,,"5","102","500","9",,"2",,,,,,,"1",,,,,,,,"8",,"1","1","1",,,,,,,,"3",,,,"4","2","2","2","2","3","630","5","4","3","1","1",,,"2","4","10","3",,"1",
"15","3.322045401997046","2.9898408617973415","16","16","15","16051","1","1964","436","1","2","4","4","2","2",,,"2","2",,,"1988","1988","1989","1","2","1",,,,,,"200","200","200",,,"1","2000","1",,,,,,,,,"650","4","1",,,,,,,,,,"3",,,,,,"1","7","2",,,,,,,,,,"6","1","1","1","4",,,,,"3",,,"3","3","3",,,"1","2","1",,"3","1","1","1"
"16","0.960782183858489","0.8647039654726401","16","16","16","16051","2","1968","254","1","1","3","3","2","2",,,"2","2",,,"1999","1999","1999","1","2","2",,"0",,,,"450","480","150","100","150","2","2500","1","2","3","4","5",,,"7","17","300","4","1",,,"4",,"6",,,,"2",,,,,"7",,"8",,"1","5","3",,"2",,,"5",,,"5","5","5","5","1","0",,,,"2","1180","5","4","5","2","2","2","3","2","5","17","2","3","1","3"
"17","1.00246163143287","0.902215468289583","16","16","17","16051","1","1958","423","3","7","2","2","3","2",,,,"2",,,"1990","1993","1993","4","6",,,"3","0","0","0","150","150","50","200","100","1","99","1",,,,,,,"5","62","600","9",,,,,,,"7",,,,,,,,,,"8",,"2",,,,,,,,,,"7","2","3","3","5","3","0","0","0","3","550","5","2","2","1","3","2","2","1","4","6","3","2","1","2"
"18","1.0869600541486493","0.9782640487337844","16","16","18","16051","2","1985","605","1","1","3","3","2","2",,,"4","2",,,"2004","2004","2004","2","16","7",,"0",,,,"50","99","50","99","99","1","99",,,,,,,,"2",,,"2",,,,,,,"7",,,,,,,,,,"8",,"2",,,,,,,,,,"1","10","10","10","3","0",,,,,,,"1",,"1",,,"6","2","2",,,"6","2","6"
"19","3.1198960800227473","2.8079064720204725","16","16","19","16051","1","1960","436","2","2","2","2","3","2",,,,"1","215","1990","1991","1995","1995","2","2",,"9","7","7","7","7","400","100","50","100","99","9","3000","1",,,,,,,"6","101","2500","9",,"2",,,,,,,"1",,,,,,,,"6",,"2",,,,,,,,,,"6","2","3","3","4","4","4","4","4","6","650","5","4","2","1","2",,"2","1","4","10","6","2","1","2"
"20","2.8037602098224736","2.5233841888402266","16","16","20","16051","2","1965","436","2","2","2","2","2","2",,,"1","2",,,"1997","1997","1997","2","2",,"9","7","7","7","7","400","100","50","100","99","9","3000","1",,,,,,,"3",,,"9",,"2",,,,,,,"1",,,,,,,,"6",,"2",,,,,,,,,,"5","4","4","3","4","4","4","4","4",,"650","5","4","2","1","2",,"3","2","3",,,"3","2","3"
"21","0.5639713695737258","0.5075742326163533","16","16","21","16044","2","1935","201","3","1","1","1","2","2",,,"1","2",,,"2002","2002","2002","2","2",,"11","6","1","1",,"99","350","99","99","99","6","99","1","2",,,,,,"3",,,"9",,,,,,"6",,,,,,,"5",,,,"99",,"2",,,,,,,,,,"11","8","8","8","1","4","1","1",,,,,,"4",,,,"4","2","3",,,"4","2","4"
"22","0.45678124277459387","0.4111031184971345","16","16","22","16044","2","1960","615","4","1","2","2","2","2",,,"2","2",,,"1996","1996","1998","2","2",,"8","4","2","2","1","300","400","50","50","99","3","2500",,"2",,,,,,"6","15","700","4","1","2",,"4",,,,,"1",,,,,,"7",,"8",,"1","1","1","1",,"3",,,,,"6","4","4","4","3","4","2","2","1","3","800","5","3","4","1","1",,"3","2","4","15","3","3","1","3"
"23","0.4593408940862115","0.41340680467759033","16","16","23","16044","2","1979","201","1","1","3","3","2","2",,,"2",,,,"1995","1995","1996","2","6",,"14","1","1","1","1","250","100","150","150","50","2","2500","1",,,,"5",,,"5","192","800","2",,,,,,,"7",,,,,,,,,,"8",,"1","5","1",,,,,,,,"3","3","3","4","1","1","1","1","1","4","650","5","3","2","2","2","1","2","2","4","19","4","2","1","2"
"24","1.8044309365791662","1.6239878429212495","16","16","24","16044","1","1959","450","2","2","3","3","2","2",,,"2","2",,,"1995","1998","1998","2","2",,"9","3","3","3","3","400","450","50","100","99","5","3200","1",,,,,,,"6","121","2000","9",,"2",,,,,,,"1",,,,,,,,"8",,"2",,,,,,,,,,"7","3","4","4","5","3","3","3","3","6","1000","5","4","4","1","2",,"2","2","4","12","6","2","1","2"
"25","0.7404588128464754","0.6664129315618278","16","16","25","16044","2","1969","450","2","2","3","3","2","2",,,"1","2",,,"1999","2002","2002","2","2",,"9","3","3","3","3","400","450","50","100","99","5","3200","1",,,,,,,"3",,,"4",,"2",,,,,,,"1",,,,,,,,"8",,"1","2","3",,,,,,,,"5","5","8","8","5","3","3","3","3",,"1000","5","4","4","1","2",,"3","2","3",,,"3","2","3"
"26","0.5188083813352617","0.4669275432017356","16","16","26","16044","1","1961","201","2","1","4","4","2","2",,,"5","2",,,"1995","1995","1995","2","2",,"9","2","2","2","2","99","300","99","99","100","4","2500","1",,,,,,,"5","61","450","4","1","2","3","4","5",,,,"1",,,,,,"7",,"1","6","2",,,,,,,,,,"6","3","3","3","1","2","2","2","2","2",,,,"3",,,"2","2","2","4","6","2","2","1","2"
"27","0.8322518730313581","0.7490266857282222","16","16","27","16044","2","1964","201","2","1","3","3","2","2",,,"5","2",,,"1995","1995","1995","2","2",,"9","2","2","2","2","400","300","100","50","100","4","3000","1",,,,,,,"5","15","250","4","1","2",,,,,,,"1",,,,,,,,"6",,"1","2","3","1",,"3",,,,,"6","3","3","3","1","2","2","2","2","2","850","5","4","3","2","1","2","2","2","4","15","2","2","1","2"
"28","1.5232990300271905","1.3709691270244713","16","16","28","16044","1","1970","436","4","7","2","2","2","2",,,"2","2",,,"1996","1997","1997","5","15","1",,"1","1","0","0","200","99","99","99","99","1","99",,,,,,,,"1",,,"9",,,,,,,,,,,,,,,,,"2","6","2",,,,,,,,,,"4","4","4","4","4","1","1","0","0",,,,"3",,,,,"3","2","1",,,"3","1","3"
"279","2.1337748403648376","1.9203973563283538","16","16","279","16024","2","1984","436","1","2","3","3","2","2",,,"4","2",,,"2003","2003","2003","5","7","7",,,,,,"250","150","280","0","0","1","2100",,,,,,"6",,"2",,,"3",,,,,,,"7",,,,,,,,,,"5","7","2",,,,,,,,,,"2","9","9","9","4",,,,,,"680","5","3","2","3","0","0","5","2","2",,,"5","2","4"
"29","0.45678124277459387","0.4111031184971345","16","16","29","16044","1","1967","615","2","1","2","2","2","2",,,"1","2",,,"2000","2000","2000","2","2",,"9","4","4","4","4","500","200","99","100","99","6","2000","1",,"3",,,,,"6","61","950","9",,"2",,,,,,,,,,,,,"7",,"8",,"2",,,,,,,,,,"5","6","6","6","3","4","4","4","4","4",,"5","5","3",,"2",,"3","2","4","6","4","3","1","3"
"30","0.45678124277459387","0.4111031184971345","16","16","30","16044","2","1970","615","2","1","2","2","2","2",,,"2","2",,,"1999","1999","2001","2","2",,"9","4","4","4","4","500","200","99","100","99","6","2000","1",,"3",,,,,"5","116","300","9",,"2",,"4",,,,,,,,,,,"7",,"5",,"1","1","1",,,,,,,,"4","5","5","7","3","4","4","4","4","2",,"5","5","3",,"2",,"3","2","4","11","2","3","1","3"
"31","0.5419280649161268","0.48773525842451415","16","16","31","16062","2","1964","201","2","1","2","2","2","2",,,"2","2",,,"1999","2001","2001","1","2",,"10","2","1","1","1","800","450","100","50","99","5","1800","1","2",,,,,,"5","5","400","9",,"2",,"4",,"6",,,"1",,,,,,"7",,"8",,"1","3","3",,,,,,,,"6","5","7","7","1","2","1","1","1","2","1400","5","5","4","2","1",,"3","2","4","5","2","3","1","3"
"32","0.45678124277459387","0.4111031184971345","16","16","32","16062","2","1978","201","1","1","3","3","2","2",,,"2","2",,,"1996","1996","1996","2","6","7",,,,,,"200","120","150","99","99",,"2000","1",,,,,,,"5","102","500","4","1",,,"4",,"6",,,"1","2",,,"5",,,,"8",,"1","4","1",,,,,,,,"3","4","4","4","1",,,,,"3",,,"3","2","2",,,"3","2","4","10","3","3","1","3"
"33","2.6482743009779424","2.383446870880148","16","16","33","16062","2","1970","423","2","1","2","2","2","2",,,"1","2",,,"1994",,,"2","2",,"9","4","4","4","4","400","500","100","50","99","6","3000",,"2","3",,,,,"4","102","400","3","1","2",,,,,,,"1",,,,,,,,"8",,"2",,,,,,,,,,"4","3",,,"5","4","4","4","4","2","1050","5","4","5","2","1",,"2","2","4","10","2","2","1","2"
"34","0.8760931040619501","0.7884837936557549","16","16","34","16062","2","1960","314","2","99","2","2","2","2",,,"1","2",,,"1998","1998","1999","2","2",,"9","3","3","3","3","450","250","99","200","99","5","3000","1",,,,,,,"5","102","600","9",,"2",,,,,,,"1",,,,,,,,"8",,"2",,,,,,,,,,"6","4","4","5","2","3","3","3","3","3",,"5","4","3",,"3",,"3","2","4","10","3","3","1","3"
"35","0.7665446377414267","0.689890173967284","16","16","35","16062","1","1957","201","2","1","2","2","3",,,,,"2",,,"1990","1991","1991","2","2",,"10","3","3","3","3","99","350","99","99","99","6","2500","1","2",,,,,,"5","61","500","9",,"2",,,,,,,,,,,,,,,"8",,"2",,,,,,,,,,"7","2","2","2","1","3","3","3","3","3",,,,"4",,,,"2","1","4","6","3","2","1","2"
"36","0.7007506888080351","0.6306756199272316","16","16","36","16062","2","1974","514","4","7","3","3","5","1",,"1",,"1","239","1999","1999","1999","2000","5","2","2",,,,,,"300","400","100","100","100","2","3000","1",,"3",,"5",,,"4","192","600","9",,,,,,,"7",,,,,,,,,,"8",,"2",,,,,,,,,,"4","5","5","6","3",,,,,"3","900","5","3","4","2","2","2","3","3","4","19","3","3","1","3"
"37","1.1300501630830597","1.0170451467747537","16","16","37","16062","1","1975","450","1","2","3","3","2","2",,,"2","2",,,"1998","1999","1999","3","6","7",,,,,,"150","200","50","100","99",,"3000",,"2",,,,,,"6","2","1100","4","1",,,,,,,,"1",,,,,,,,"8",,"2",,,,,,,,,,"3","4","5","5","5",,,,,"5","500","5","2","3","1","2",,"3","2","4","2","5","3","1","3"
"38","1.1300501630830597","1.0170451467747537","16","16","38","16062","1","1974","450","2","2","3","3","2","2",,,"3","2",,,"1996","2000","2000","1","6","7",,"1","0","0","0","200","200","80","100","99",,"2500",,"2",,,,,,"10","10",,"9","1",,,,,,,,"1",,,,,,,,"8",,"2",,,,,,,,,,"4","4","6","6","5","1","0","0","0",,"580","5","3","3","2","2",,"3","2","7","10",,"3","1","3"
"39","1.8785622259436532","1.6907060033492878","16","16","39","16062","2","1954","235","2","1","2","2","2","2",,,"2","2",,,"2004","2004","2004","1","11","1",,"2","0","0","0","100","50","99","200","250","1","99",,,,,,,,"4","16","650","9","1",,,,,,,,,,"3",,,,,,"8",,"1","4","1","1","2","3","4",,,,"8","10","10","10","1","2","0","0","0","3",,"4","2","1",,"3","3","6","2","4","16","3","6","1","6"
"40","0.7655681568103525","0.6890113411293173","16","16","40","16062","1","1939","337","3","7","3","3","1","2",,,,"1","219","1984","1964","1980","1980","2","2",,"8","3","3","2",,"550","400","150","99","100","3","3000","1",,"3","4","5","6",,"6","208","1300","4","1",,,"4",,,,,,,,,,,"7",,"8",,"2",,,,,,,,,,"11","1","1","1","2","3","3","2",,"5",,,"5","4","2",,"2","1","1","4","20","5","1","1","1"
"41","0.6485104766690772","0.5836594290021694","16","16","41","16040","2","1964","604","2","1","2","2","2","2",,,"1","2",,,"1995","1997","1997","2","2",,"9","5","3","3","3","900","500","80","50","99","5","99",,"2","3",,,,,"8","15","350","4","1","2",,,"5",,,,,,,,,,"7",,"5",,"1","4","1","1","2","3",,,,,"6","3","4","4","3","4","3","3","3","2","1530","5","5","5","2","1",,"2","2","5","15","2","2","1","2"
"42","0.7007506888080351","0.6306756199272316","16","16","42","16040","1","1962","604","2","1","2","2","1","2",,,"2","2",,,"1990","1993","1993","1","2",,"9","5","3","3","3","99","500","80","50","99","5","3000",,,,,,,,"6","2","1100","99","1","2",,,,,,,"1",,,,,,"7",,"8",,"2",,,,,,,,,,"6","2","3","3","3","4","3","3","3","5",,,,"5","2","1",,"2","1","4","2","5","2","1","2"
"43","1.2523748172957687","1.1271373355661918","16","16","43","16040","2","1960","609","2","1","2","2","2","2",,,"1","2",,,"2000","2000","2000","1","2",,"8","4","2","2",,"400","380","60","100","50","4","2500",,"2",,,,,,"4","15","500","9",,"2",,,,,,,"1",,,,,,,,"8",,"1","2","3","1","2","3",,"5",,,"6","6","6","6","3","4","2","2",,"3","940","5","4","4","2","2","1","3","2","4","15","3","3","1","3"
"44","1.1804055087789678","1.0623649579010708","16","16","44","16040","2","1974","443","4","6","2","2","6",,,,,"2",,,"2003","2003","2004","5","6","7",,"2","0","0","0","200","200","100","99","99","1","99",,,,,,,,"7","21","99","1",,,,,,,"7",,,,,,,,,,"1",,"2",,,,,,,,,,"4","9","9","10","5","2","0","0","2",,,,"3","3","2",,,"5","4","5","21",,"5","1","4"
"45","2.376108406105616","2.1384975654950544","16","16","45","16040","2","1959","235","4","1","3","3","2","1","1","1","2","2",,,"2001","2001","2001","2","11","1",,"1","0","0","0","300",,"200",,"200","1","2200",,,,,,,,"6","14","800","4","1",,,,,,,,"1",,,,,,,,"5",,"1","1","1","1","2","3",,"5",,,"7","7","7","7","1","1","0","0","0","4",,,"3",,"3",,"3","3","2","4","14","4","3","1","3"
"46","0.5525851024029915","0.4973265921626923","16","16","46","16040","2","1978","201","1","1","3","3","2","1",,,"2","2",,,"1998","1999","1999","1","2","2",,"0",,,,"450","250","150","200","100","2","3000","1",,"3",,"5","6",,"6","103","850","6",,,,,,,"7",,,,,,,,,,"8",,"1","1","1",,,,,,,,"3","4","5","5","1","0",,,,"4","1050","5","4","3","2","3","2","3","2","4","10","4","3","1","3"
"47","1.0909072375736508","0.9818165138162855","16","16","47","16040","2","1966","251","1","1","2","1","2","2",,,"5","2",,,"1993","1995","1995","2","2",,"9","2","2","2","2","350","300","99","99","99","4","2000","1",,,,,,,"3",,,"4","1",,,"4",,"6",,,,,,,,,"7",,"4","6","2",,,,,,,,,,"5","3","3","3","1","2","2","2","2",,,,"4","3",,,,"2","2","3",,,"2","2","2"
"48","1.297417421395417","1.1676756792558753","16","16","48","16040","2","1959","224","2","2","2","1","2","2",,,"5","1","220","1990","1992","1994","1994","3","14",,"9","8","7","5","5","450","99","99","99","99","8","99","1","2",,,,,,"1",,,"2",,,"3",,,"6",,,"1","2",,,,,,,"2","6","2",,,,,,,,,,"7","2","3","3","1","4","4","4","4",,,,"4",,,,,"2","2","1",,,"2","1","2"
"49","0.9406147475201635","0.8465532727681472","16","16","49","16040","2","1987","224","1","7","2","2","2","2",,,"5","2",,,"1994","1998","1998","3","14",,,"0",,,,"99","99","99","99","99","8","99","1","2",,,,,,"1",,,"2",,,"3",,,,,,,"2",,,,,,,"2","6","2",,,,,,,,,,"1","3","4","4","1","0",,,,,,,,,,,,"2","2","1",,,"2","1","2"
"218","1.157350170549505","1.0416151534945546","16","16","218","16219","2","1979","436","1","2","3","3","1","2",,,"4","2",,,"2003","2003","2003","3","9","7",,,,,,"200","250","100","0","0","1","1500",,,,"4",,"6",,"2",,,"8",,,,,,,"7",,,,,,,,,,"5","6","2",,,,,,,,,,"3","9","9","9","4",,,,,,"550","5","3","3","2","0","0","5","1","2",,,"5","2","4"
"50","0.7655681568103525","0.6890113411293173","16","16","50","16040","2","1967","466","2","1","3","3","2","2",,,"1","2",,,"1993","1995","1995","1","2",,"9","2","2","2","2","500","350","100","150","100","4","2000","1","2","3",,,"6",,"6","19","2200","9",,"2","3",,,,,,,,,,,,"7",,"8",,"1","5","3",,,,,,,,"5","3","3","3","5","2","2","2","2","6","1100","5","5","4","2","2","2","2","2","4","19","6","2","1","2"
"51","1.2523748172957687","1.1271373355661918","16","16","51","16024","1","1952","602","4","7","4","3","2","2",,,"2","1","215","1994","1996","1996","1996","1","2","1",,,,,,"200","300","50","99","99","1","2500","1",,"3",,,,,"4","16","800","9",,,,,,,"7",,,,,,,,,,"8",,"1","6","1",,,,,,"6",,"8","4","4","4","3",,,,,"4",,,"3","3","1",,,"3","2","4","16","4","3","1","3"
"52","1.3314263087352667","1.19828367786174","16","16","52","16024","2","1967","224","4","99","3","3","2","2",,,"5","2",,,"1997","1997","1997","1","2",,"9","2","2","2","2","400","400","100","100","50","4","2500","1","2","3",,,,,"6","72","750","2","1","2","3",,,,,,"1","2",,,,,,,"8",,"1","1","1",,,,,,,,"5","4","4","4","1","2","2","2","2","4","1000","5","4","4","2","2","1","3","2","4","7","4","3","1","3"
"53","0.7007506888080351","0.6306756199272316","16","16","53","16024","1","1976","311","1","7","2","2","2","1",,"1","3","2",,,"1999","1999","1999","1","6","6",,"0",,,,"150","200","50","50","99","2","99","1",,,,,,,"10","10","600","4","1",,"3",,,,,,"1",,,,,,,,"8",,"1","1","1",,,,,,,,"3","5","5","5","2","0",,,,"3","450","4","2","3","1","1",,"3","2","7","10","3","3","1","3"
"54","0.9209751706716525","0.8288776536044871","16","16","54","16024","2","1952","609","2","1","3","3","3",,,,,"2",,,"1978","1978","1978","1","1",,"9","3","3","3","1","500","300","200","300","200","5","250","1","2","3","4","5","6",,"3",,,"4",,,,,,,"7",,,,,,,,,,"8",,"2",,,,,,,,,,"8","1","1","1","3","3","3","3","1",,"1300","5","5","3","3","3","3","1","1","3",,,"1","2","1"
"55","0.5561633908907376","0.5005470518016639","16","16","55","16024","2","1967","254","1","1","3","3","2","2",,,"5","2",,,"2002","2003","2003","1","10",,,"0","0","0","0","50","99","20","99","99","99","99",,,,,,,,"1",,,"2",,,,"4",,,,,,"2",,,,,"7",,"7",,"2",,,,,,,,,,"5","8","9","9","1","0","0","0","0",,,,"1",,"1",,,"4","2","1",,,"4","1","4"
"56","1.5840722707370773","1.4256650436633693","16","16","56","16024","1","1966","324","2","2","3","3","1","2",,,"2","2",,,"1983","1986","1987","1","2",,"9","4","4","4","4","400","500","400",,,"6","2000","1","2","3",,"5",,,"6","64","900","4","1","2","3","4","5",,,,"1",,"3",,,,,,"1","2","2",,,,,,,,,,"5","1","1","1","2","4","4","4","4","4",,,"4","5","4",,,"1","1","4","6","4","1","1","1"
"57","1.5840722707370773","1.4256650436633693","16","16","57","16024","2","1972","324","2","2","4","3","1","2",,,"1","2",,,"1991","1991","1991","1","2",,"9","4","4","4","4","400","500","400",,,"6","2500","1","2","3",,"5",,,"3",,,"4","1","2","3","4","5",,,,"1","2","3",,,,,,"5","6","2",,,,,,,,,,"4","2","2","2","2","4","4","4","4",,,,"4","5","4",,,"2","1","3",,,"2","2","2"
"58","1.1506310612282098","1.0355679551053887","16","16","58","16024","1","1965","324","2","2","3","3","3","2",,,,"2",,,"1982","1986","1987","1","1",,"9","3","3","3","3","500","300","400","250",,"5","3000","1",,"3","4",,,,"10","91","1000","9","1","2","3","4","5",,,,"1",,,,,,,,"8",,"2",,,,,,,,,,"5","1","1","1","2","3","3","3","3","5","1450","5","5","3","4","3",,"1","1","7","9","5","1","1","1"
"59","1.5840722707370773","1.4256650436633693","16","16","59","16024","1","1975","311","1","99","2","2","2","1","1","1","3","2",,,"1999","1999","1999","1","6","6",,"0",,,,"150","200","50","50","99","2","99",,"2",,,,,,"10","10","700","9",,,,,,,"7",,,,,,,,,,"8",,"1","6","3",,,,,,,,"3","5","5","5","2","0",,,,"3","450","4","2","3","1","1",,"3","2","7","10","3","3","1","3"