"id","id_prov","quest","pesiprov","pesireg","prov","prov2","b","c","d","e1","e2","e3","e4","e5","e6","e7","e8","e9","e10","e11","e12","d1","d2","d3","d4","d4b","d5","d5b","d6","d6b","d7","d8","d9","d10","d11","d12","d13","d14","d15","d16a","d16b","d16bbis","d16c","d16d","d17a","d17b","d17c","d17d","d17e","d17f","d17g","d18a","d18b","d19","d20","d21","d22","d23_1","d23_2","d23_3","d23_4","d23_5","d23_99","d24_1","d24_2","d24_3","d24_4","d24_99","d25a1","d25a2","d25b1","d25b2","d25c1","d25c2","d26_1","d26_2","d27_a","d27_b","d27_c","d27_d","d28_a","d28_b","d29","d30","d31","d32_a","d32_b","d32_c","d32_d","d32_e","d32_f","d32_g","d32_h","d32_i","d32_l","tipo_lav","areacitt","eta","arrita","res_prov","ps","arr_ita","arr_lomb","arr_prov","fg_ita","fg_tot","fg_ester","fg_conv","fg_c_min","sp_alim","sp_casa","sp_altre","rimesse","rispa","reddito","red_nec"
"1","1","1","0.585812892659455","0.3924946380818349","12","12","3","12042","7","1","1","1","1","1","1","1","0","0","0","1","0","2","1972","514","2002",,"2002",,"2003",,"4","2","3","2","6",,"1","2","2","0","0","0","0","0","500","500","200","2","100","100","3000","5","5",,,"102","700","1","0","0","0","0","0","1","0","0","0","0",,,,,,,"7",,"3","3","2","2","1","1",,,,,,,,,,,,,,"10","5","4","2002","1","1","2002","2002","2003","0","0","0","0","0","4500","4500","300","150","150","750","3500"
"2","2","2","0.512061690824029","0.3430813328520994","12","12","3","12042","6","1","1","0","1","0","1","1","0","0","0","1","0","1","1974","409","2000",,"2000",,"2002",,"7","1","1","1","2","2","1","6","7","0","0","0","0","0","200","300","200","1","100","100","2500","6","6",,,"1","900","1","0","0","0","0","0","1","0","0","0","0",,,,,,,"4",,"3","3","2","2","1","1",,,,,,,,,,,,,,"1","4","4","2001","1","1","2000","2000","2002","0","0","0","0","0","300","300","300","150","150","1000","2500"
"3","3","3","0.566057086082773","0.37925824767545796","12","12","3","12042","7","1","1","1","1","1","1","1","0","0","0","1","0","1","1980","305","2001",,"2001",,"2001",,"1","1","2","1","5",,"5","6","7","0","0","0","0","0","100","150","100","1","0","0","2500","1","8",,,,"0","1","0","0","0","0","0","1","0","0","0","0",,,,,,,"4",,"3","2","3","3","1","1",,,,,,,,,,,,,,,"2","3","2001","2","2","2001","2001","2001","0","0","0","0","0","150","150","150","0","0","0","2500"
"4","4","4","1.6983997692034","1.137927845366278","12","12","3","12042","11","1","1","1","1","1","1","1","0","0","0","1","0","2","1979","517","2000",,"2000",,"2003",,"1","1","3","2","2","2",,"6","7","0","0","0","0","0","100","200","100","1","0","0","3000","1","5",,,,"0","1","0","0","0","0","0","1","0","0","0","0",,,,,,,"4",,"3","3","3","3","1","1",,,,,,,,,,,,,,,"5","3","2001",,"1","2000","2000","2003","0","0","0","0","0","150","300","150","0","0","0","3500"
"5","5","5","1.34793163516497","0.9031141955605297","12","12","3","12042","7","1","1","0","1","1","0","1","0","0","1","1","0","1","1969","419","1997",,"2000",,"2001",,"3","2","3","1","2","2","1","1","2","1","0","1","0","0","400","500","300","2","300","100","4000","6","6",,,"1","950","1","0","0","0","0","0","0","1","0","0","0","1","12",,,,,"3",,"3","4","3","3","1","1",,,,,,,,,,,,,,"1","3","5","1998","1","1","1998","2000","2001","0","1","1","0","0","450","4500","300","300","150","1000","4500"
"6","6","6","0.874634307790152","0.5860049862194019","12","12","3","12042","7","0","0","0","0","0","0","1","0","0","0","0","0","2","1979","254","1999",,"1999",,"2003",,"1","1","4","2","2","2","1","2",,"0","0","0","0","0","300","300","200","2","200","200","3000","4","1",,,"14","700","1","0","0","0","0","0","1","0","0","0","0",,,,,,,"4",,"3","2","2","3","1","1",,,,,,,,,,,,,,"14","1","3","2001","1","1","1999","1999","2003","0","0","0","0","0","300","300","300","300","300","750","3500"
"7","7","7","0.566584752831877","0.3796117843973576","12","12","3","12042","7","1","1","1","1","1","1","1","0","0","0","1","0","2","1977","615","2000",,"2000",,"2001",,"7","1","3","2","2","2","1","6","7","0","0","0","0","0","300","300","300","1","100","100","3000","6","5",,,"14","800","1","0","0","0","0","0","1","0","0","0","0",,,,,,,"4",,"3","3","2","2","1","1",,,,,,,,,,,,,,"14","5","3","2001","1","1","2000","2000","2001","0","0","0","0","0","300","300","300","150","150","1000","3500"
"8","8","8","0.512061690824029","0.3430813328520994","12","12","3","12042","7","1","1","0","1","1","1","1","0","0","0","1","0","2","1979","604","2001",,"2001",,"2001",,"7","1","3","5","2","2","1","6","7","0","0","0","0","0","350","250","300","1","100","50","3000","6","5",,,"14","1050","1","0","0","0","0","0","1","0","0","0","0",,,,,,,"4",,"3","2","2","2","1","1",,,,,,,,,,,,,,"14","5","3","2001","1","1","2001","2001","2001","0","0","0","0","0","450","300","300","150","50","1500","3500"
"9","9","9","1.4781974655936","0.990392301947712","12","12","3","12042","7","1","1","0","1","1","1","1","1","0","0","1","0","1","1972","608","1998",,"1998",,"2002",,"7","2","3","5","2","3","1","2","9","1","1","0","1","1","400","450","300","3","200","200","2500","10","5",,"6","6","950","1","0","0","0","0","0","1","0","0","0","0",,,,,,,"3",,"3","2","2","2","1","2",,,,,,,,,,,,,,"6","5","4","1998","1","1","1998","1998","2002","1","1","0","1","1","450","450","300","300","300","1000","2500"
"10","10","10","0.534982630653331","0.35843836253773176","12","12","3","12042","7","1","1","0","1","1","0","1","0","0","0","1","0","2","1969","609","1998",,"2000",,"2000",,"8","2","3","2","2","2","1","2","9","1","1","0","1","1","400","500","300","3","300","200","2500","4","1",,,"14","750","1","0","0","0","0","0","1","0","0","0","0",,,,,,,"3",,"3","2","2","2","1","1",,,,,,,,,,,,,,"14","5","5","1998","1","1","1998","2000","2000","1","1","0","1","1","450","4500","300","300","300","750","2500"
"11","11","11","0.512061690824029","0.3430813328520994","12","12","3","12119","7","1","1","1","1","1","1","1","0","0","0","1","0","2","1967","443","1999",,"1999",,"1999",,"1","2","2","2","2","2","1","2","9","1","1","0","1","1","400","450","300","3","300","200","4000","6","5",,,"13","900","1","0","0","0","0","0","1","0","0","0","0",,,,,,,"4",,"3","3","3","3","1","1",,,,,,,,,,,,,,"13","4","5","2001","1","1","1999","1999","1999","1","1","0","1","1","450","450","300","300","300","1000","4500"
"12","12","12","0.512061690824029","0.3430813328520994","12","12","3","12119","1","1","1","1","1","1","1","1","0","0","0","1","0","1","1965","330","1994",,"1996",,"1998",,"1","2","3","1","1","2","1","1","9","2","2","0","2","2","600","500","200","4","200","200","3000","6","6",,,"25","1200","0","0","1","0","0","0","1","0","0","0","0",,,,,,,"3",,"2","3","3","3","1","1",,,,,,,,,,,,,,"2","2","6","1995","1","1","1995","1998","1998","2","2","0","2","2","4500","4500","300","300","300","1500","3500"
"13","13","13","0.517586308082021","0.34678282641495406","12","12","3","12119","11","1","1","1","1","1","1","1","0","0","0","1","0","2","1976","209","2000",,"2000",,"2000",,"1","1","4","5","2","2","2","6","7","0","0","0","0","0","200","200","300","1","300","100","3000","4","4",,,"13","1100","1","0","0","0","0","0","1","0","0","0","0",,,,,,,"4",,"3","2","2","3","2","1",,,,,,,,,,,,,,"13","1","3","2001","1","1","2000","2000","2000","0","0","0","0","0","300","300","300","300","150","1500","3500"
"14","14","14","0.646295674994596","0.43301810224637927","12","12","3","12119","7","1","1","0","1","1","0","1","0","1","0","1","0","1","1973","311","1999",,"2000",,"2000",,"9","2","3","1","2","2","1","6","7","0","0","0","0","0","200","250","300","1","100","100","3000","6","6",,,"4","950","1","0","0","0","0","0","0","0","1","0","0",,,,,,,"2",,"2","3","2","2","2","2",,,,,,,,,,,,,,"4","2","4","2001","1","1","1999","2000","2000","0","0","0","0","0","300","300","300","150","150","1000","3500"
"15","15","15","0.512061690824029","0.3430813328520994","12","12","3","12119","1","1","1","0","1","1","0","1","1","0","0","1","0","2","1987","404","2000",,"2000",,"2002",,"1","2","2","2","2","1","1","2","9","1","1","0","1","1","350","500","400","3","200","200","2800","4","4",,,"14","600","0","0","1","0","0","0","1","0","0","0","0",,,,,,,"4",,"2","3","3","2","2","2",,,,,,,,,,,,,,"14","4","1","2001","1","1","2000","2000","2002","1","1","0","1","1","450","4500","450","300","300","750","3500"
"16","16","16","0.512061690824029","0.3430813328520994","12","12","3","12119","7","1","1","0","1","1","1","1","0","0","0","1","0","1","1978","344","2000",,"2000",,"2002",,"1","1","2","1","2","2","1","6","7","0","0","0","0","0","200","200","100","1","200","100","2500","6","5",,,"1","800","1","0","0","0","0","0","1","0","0","0","0",,,,,,,"2",,"2","3","3","2","2","3",,,,,,,,,,,,,,"1","2","3","2001","1","1","2000","2000","2002","0","0","0","0","0","300","300","150","300","150","1000","2500"
"17","17","17","0.512061690824029","0.3430813328520994","12","12","3","12119","7","1","1","1","1","1","0","1","1","0","0","1","0","1","1975","409","1998",,"2002",,"2003",,"1","1","2","1","2","2","2","2",,"0","0","0","0","0","300","350","200","2","400","200","2500","6","1",,,"1","850","1","0","0","0","0","0","1","0","0","0","0",,,,,,,"2",,"3","2","2","2","1","2",,,,,,,,,,,,,,"1","4","4","1998","1","1","1998","2002","2003","0","0","0","0","0","300","450","300","450","300","1000","2500"
"18","18","18","0.936838241363384","0.6276816217134672","12","12","3","12119","1","1","1","0","1","1","1","0","0","0","0","1","0","2","1967","235","2003",,"2003",,"2003",,"1","2","4","2","5",,"5","6","6","0","0","0","0","0","200","200","100","2","200","0","2000","7","7",,,"15","700","1","0","0","0","0","0","1","0","0","0","0",,,,,,,,,,,,,,,,,,,,,,,,,,,,"15","1","5","2003","2","2","2003","2003","2003","0","0","0","0","0","300","300","150","300","0","750","2000"
"19","19","19","1.04589691659532","0.7007509341188645","12","12","3","12119","4","1","1","1","1","1","1","1","1","0","0","1","0","1","1972","609","2000",,"2000",,"2002",,"8","1","3","2","2","2","1","2","4","0","0","0","0","0","600","500","600","3","400","400","3000","6","4",,,"41","1000","1","0","0","0","0","0","1","0","0","0","0",,,,,,,"2",,"2","3","3","3","1","3",,,,,,,,,,,,,,"4","5","4","2001","1","1","2000","2000","2002","0","0","0","0","0","4500","4500","4500","450","450","1000","3500"
"20","20","20","0.517586308082021","0.34678282641495406","12","12","3","12119","11","1","1","0","1","1","1","1","0","1","0","1","0","2","1975","209","2002",,"2002",,"2002",,"1","1","4","5","5",,"5","6","7","0","0","0","0","0","200","200","200","1","100","0","3000","8","8",,,"14","700","1","0","0","0","0","0","1","0","0","0","0",,,,,,,"2",,"3","2","2","2","1","1",,,,,,,,,,,,,,"14","1","4","2002","2","2","2002","2002","2002","0","0","0","0","0","300","300","300","150","0","750","3500"
"21","21","21","1.44520866225796","0.9682898037128334","12","12","3","12119","11","1","1","0","1","1","1","1","0","1","0","1","0","1","1968","201","1996",,"1996",,"2000",,"9","2","3","10","1","2","2","2","9","1","1","0","1","1","400","500","200","3","200","100","2000","6","6",,,"41","1000","0","0","1","0","0","0","1","0","0","0","0",,,,,,,"2",,"3","2","2","2","1","1",,,,,,,,,,,,,,"4","1","5","1998","1","1","1998","1998","2000","1","1","0","1","1","450","4500","300","300","150","1000","2000"
"22","22","22","0.512061690824029","0.3430813328520994","12","12","3","12119","7","1","1","0","1","1","1","1","0","0","1","1","0","2","1973","243","1999",,"1999",,"2000",,"1","2","3","2","2","2","2","6","7","1","0","1","0","0","200","250","200","1","300","50","2500","4","4",,,"15","1000","1","0","0","0","0","0","1","0","0","0","0",,,,,,,"4",,"2","3","3","3","2","2",,,,,,,,,,,,,,"15","1","4","2001","1","1","1999","1999","2000","0","1","1","0","0","300","300","300","300","50","1000","2500"
"23","23","23","0.512061690824029","0.3430813328520994","12","12","3","12119","11","1","1","1","1","1","1","1","0","0","0","1","0","1","1972","401","1998",,"2000",,"2000",,"1","1","2","1","2","2","1","6","7","0","0","0","0","0","200","200","200","1","300","200","4000","6","5",,,"1","1100","1","0","0","0","0","0","1","0","0","0","0",,,,,,,"3",,"3","2","2","2","1","2",,,,,,,,,,,,,,"1","3","4","1998","1","1","1998","2000","2000","0","0","0","0","0","300","300","300","300","300","1500","4500"
"24","24","24","1.00619460854952","0.6741503877281784","12","12","3","12119","11","1","1","0","1","1","1","1","1","0","0","1","0","1","1989","436","1998",,"1998",,"2002",,"3","1","3","1","2","2","1","6","7","0","0","0","0","0","200","250","300","1","300","100","2500","6","1",,,"41","1150","1","0","0","0","0","0","1","0","0","0","0",,,,,,,"2",,"3","2","3","2","1","2",,,,"4","4","4","4","4",,,,,,"4","3","1","1998","1","1","1998","1998","2002","0","0","0","0","0","300","300","300","300","150","1500","2500"
"25","25","25","0.512061690824029","0.3430813328520994","12","12","3","12119","1","1","1","1","1","0","0","1","1","0","0","1","0","1","1968","418","1996",,"1996",,"2000",,"1","2","3","2","1","2","1","1","9","1","1","0","1","1","350","500","300","3","200","200","2000","6","6",,,"1","900","0","0","1","0","0","0","1","0","0","0","0",,,,,,,"3",,"3","2","3","2","1","1",,,,,,,,,,,,,,"1","4","5","1998","1","1","1998","1998","2000","1","1","0","1","1","450","4500","300","300","300","1000","2000"
"26","26","26","0.512061690824029","0.3430813328520994","12","12","3","12119","2","1","1","0","1","1","1","1","0","0","0","1","0","1","1972","254","1999",,"1999",,"2003",,"1","2","4","3","2","2","1","2","2","1","0","1","0","0","400","500","200","2","300","200","3000","4","1",,,"15","750","1","0","0","0","0","0","1","0","0","0","0",,,,,,,"4",,"3","2","3","3","1","3",,,,,,,,,,,,,,"15","1","4","2001","1","1","1999","1999","2003","0","1","1","0","0","450","4500","300","300","300","750","3500"
"27","27","27","0.533120397427199","0.3571906662762233","12","12","3","12119","2","1","1","0","1","1","1","1","1","0","0","1","0","1","1968","458","1999",,"1999",,"1999",,"9","1","4","1","2","5","2","6","7","0","0","0","0","0","200","300","300","1","100","100","3000","6","5",,,"10","1000","1","0","0","0","0","0","1","0","0","0","0",,,,,,,"2",,"3","3","3","3","1","1",,,,,,,,,,,,,,"10","4","5","2001","1","1","1999","1999","1999","0","0","0","0","0","300","300","300","150","150","1000","3500"
"28","28","28","0.512061690824029","0.3430813328520994","12","12","3","12119","7","1","1","0","1","1","1","1","1","0","0","1","0","2","1971","235","1998",,"1998",,"2002",,"1","2","3","2","2","2","2","2","2","1","0","1","0","0","300","500","250","2","300","250","2000","4","4",,,"14","700","1","0","0","0","0","0","1","0","0","0","0",,,,,,,"2",,"3","3","3","3","1","2",,,,,,,,,,,,,,"14","1","4","1998","1","1","1998","1998","2002","0","1","1","0","0","300","4500","300","300","300","750","2000"
"29","29","29","0.553852798256229","0.37108137483167347","12","12","3","12119","1","1","1","0","1","1","1","1","0","0","0","1","0","2","1975","235","2000",,"2000",,"2000",,"1","2","3","3","2","2","1","6","7","1","0","1","0","0","200","200","300","1","300","50","2000","4","4",,,"14","850","1","0","0","0","0","0","0","0","1","0","0",,,,,,,"6",,"3","2","2","2","1","2",,,,,,,,,,,,,,"14","1","4","2001","1","1","2000","2000","2000","0","1","1","0","0","300","300","300","300","50","1000","2000"
"30","30","30","0.561958977836335","0.37651251515034445","12","12","3","12119","7","1","1","0","1","0","1","1","1","0","0","1","0","1","1972","615","1998",,"1998",,"2003",,"7","2","3","9","2","2","1","2","2","0","0","0","0","0","350","500","300","2","200","200","2000","6","4",,,"1","900","1","0","0","0","0","0","1","0","0","0","0",,,,,,,"2",,"2","3","3","3","1","2",,,,,,,,,,,,,,"1","5","4","1998","1","1","1998","1998","2003","0","0","0","0","0","450","4500","300","300","300","1000","2000"
"31","31","31","0.512061690824029","0.3430813328520994","12","12","3","12119","7","1","1","0","0","1","0","1","1","0","0","1","0","1","1968","344","1994",,"1998",,"1998",,"9","2","2","1","1","2","1","1","9","1","1","0","1","1","300","500","300","3","200","300","2500","6","6",,,"22","1100","0","0","1","0","0","0","1","0","0","0","0",,,,,,,"5",,"3","3","2","2","1","1",,,,,,,,,,,,,,"2","2","5","1995","1","1","1995","1998","1998","1","1","0","1","1","300","4500","300","300","300","1500","2500"
"32","32","32","0.512061690824029","0.3430813328520994","12","12","3","12119","11","1","1","1","1","1","0","1","0","0","0","1","0","1","1971","401","2000",,"2000",,"2002",,"1","2","2","1","2","2","1","6","7","1","0","1","0","0","200","200","150","1","300","200","3000","4","1",,,"1","1050","1","0","0","0","0","0","0","1","0","1","0","1","12",,,,,"6",,"3","3","3","3","1","1",,,,,,,,,,,,,,"1","3","4","2001","1","1","2000","2000","2002","0","1","1","0","0","300","300","150","300","300","1500","3500"
"33","33","33","0.512061690824029","0.3430813328520994","12","12","3","12119","7","1","1","0","1","1","0","1","0","0","1","1","0","2","1978","606","1998",,"1998",,"2001",,"3","1","3","2","2","2","1","6","7","0","0","0","0","0","200","250","200","1","100","100","2500","4","4",,,"14","850","1","0","0","0","0","0","1","0","0","0","0",,,,,,,"2",,"3","2","2","2","1","3",,,,,,,,,,,,,,"14","5","3","1998","1","1","1998","1998","2001","0","0","0","0","0","300","300","300","150","150","1000","2500"
"34","34","34","0.84355784875273","0.5651837586643291","12","12","3","12119","7","1","1","0","1","1","1","1","0","0","0","1","0","1","1968","460","1999",,"1999",,"2001",,"1","2","2","1","2","2","1","6","7","0","0","0","0","0","200","250","300","1","250","100","3000","1","4",,,,"0","1","0","0","0","0","0","1","0","0","0","0",,,,,,,"3",,"3","2","3","2","1","1",,,,,,,,,,,,,,,"3","5","2001","1","1","1999","1999","2001","0","0","0","0","0","300","300","300","300","150","0","3500"
"35","35","35","0.786430820885138","0.5269086499930425","12","12","3","12119","4","1","1","0","1","0","1","0","1","0","0","1","0","2","1965","243","1997",,"1997",,"2000",,"1","2","3","2","1","2","1","1","9","1","1","0","1","0","400","500","300","3","200","200","2500","4","4",,,"14","800","1","0","0","0","0","0","1","0","0","0","0",,,,,,,"6",,"3","3","2","3","1","1",,,,,,,,,,,,,,"14","1","6","1998","1","1","1998","1998","2000","1","1","0","1","0","450","4500","300","300","300","1000","2500"
"36","36","36","0.512061690824029","0.3430813328520994","12","12","3","12026","7","1","1","0","1","1","1","1","0","0","0","1","0","1","1969","344","2000",,"2000",,"2000",,"1","1","3","1","5",,"5","6",,"0","0","0","0","0","200","250","300","1","200","200","3000","7","7",,,"1","750","1","0","0","0","0","0","1","0","0","0","0",,,,,,,"3",,"2","3","3","3","1","1",,,,,,,,,,,,,,"1","2","5","2001","2","2","2000","2000","2000","0","0","0","0","0","300","300","300","300","300","750","3500"
"37","37","37","0.899105822871841","0.6024009013241335","12","12","3","12026","11","1","1","0","1","1","0","0","1","0","0","1","0","2","1975","514","2001",,"2001",,"2004","1","4","2","3","2","2","1","1","2","2","0","0","0","0","0","400","400","300","2","100","100","2500","4","1",,,"14","600","0","1","0","0","0","0","1","0","0","0","0",,,,,,,"4",,"3","3","2","2","1","1",,,,,,,,,,,,,,"14","5","4","2001","1","1","2001","2001","2004","0","0","0","0","0","450","450","300","150","150","750","2500"
"38","38","38","0.512061690824029","0.3430813328520994","12","12","3","12026","4","1","1","0","1","1","1","1","0","0","0","1","0","2","1965","404","2001",,"2001",,"2001",,"1","2","3","2","1","2","1","2","4","2","0","2","0","0","200","300","100","2","250","100","2000","4","4",,,"6","950","1","0","0","0","0","0","0","1","0","0","0","1","13","1","10",,,"3",,"3","3","3","3","1","2",,,,,,,,,,,,,,"6","4","6","2001","1","1","2001","2001","2001","0","2","2","0","0","300","300","150","300","150","1000","2000"
"39","39","39","0.512061690824029","0.3430813328520994","12","12","3","12026","1","1","1","0","1","1","1","1","0","0","0","1","0","1","1972","411","1999",,"1999",,"2002",,"5","1","4","2","1","3","1","6","7","0","0","0","0","0","200","200","200","1","200","350","2500","10","10","1","4","123","1200","1","0","0","0","0","0","1","0","0","0","0",,,,,,,"2",,"3","3","3","4","1","1",,,,,,,,,,,,,,"12","4","4","2001","1","1","1999","1999","2002","0","0","0","0","0","300","300","300","300","450","1500","2500"
"40","40","40","1.48438350876188","0.9945369508704596","12","12","3","12026","7","1","1","0","1","1","1","1","0","0","0","1","0","1","1969","423","1998",,"1998",,"2000",,"1","2","2","2","1","2","2","2","2","1","0","1","0","0","250","500","200","2","200","250","2000","4","4",,,"1","800","1","0","0","0","0","0","1","0","0","0","0",,,,,,,"4",,"3","3","3","3","1","1",,,,,,,,,,,,,,"1","4","5","1998","1","1","1998","1998","2000","0","1","1","0","0","300","4500","300","300","300","1000","2000"
"41","41","41","0.512061690824029","0.3430813328520994","12","12","3","12026","1","1","1","1","1","1","0","1","0","0","0","1","0","1","1980","409","2001",,"2001",,"2002",,"1","1","2","1","2","2","2","6","7","0","0","0","0","0","200","200","200","1","100","100","2000","4","1",,,"1","800","1","0","0","0","0","0","1","0","0","0","0",,,,,,,"4",,"3","4","3","3","1","1",,,,,,,,,,,,,,"1","4","3","2001","1","1","2001","2001","2002","0","0","0","0","0","300","300","300","150","150","1000","2000"
"42","42","42","0.512061690824029","0.3430813328520994","12","12","3","12026","11","1","1","0","1","1","1","1","0","0","0","1","0","2","1967","411","1996",,"1998",,"2000",,"1","2","3","2","1","2","1","1","9","1","1","0","1","1","300","500","350","3","200","200","2000","4","1",,,"13","700","1","0","0","0","0","0","1","0","0","0","0",,,,,,,"4",,"3","3","3","3","1","1",,,,,,,,,,,,,,"13","4","5","1998","1","1","1998","1998","2000","1","1","0","1","1","300","4500","450","300","300","750","2000"
"43","43","43","0.512061690824029","0.3430813328520994","12","12","3","12026","7","1","1","0","1","1","0","1","0","0","0","1","0","1","1967","401","1998",,"1998",,"2000",,"1","2","3","1","2","2","2","2",,"0","0","0","0","0","250","200","20","1","300","100","2000","6","6",,,"22","1050","1","0","0","0","0","0","0","0","1","0","0",,,,,,,"3",,"3","3","3","3","1","1",,,,,,,,,,,,,,"2","3","5","1998","1","1","1998","1998","2000","0","0","0","0","0","300","300","50","300","150","1500","2000"
"44","44","44","1.24912382454319","0.8369129624439373","12","12","3","12026","11","1","0","1","1","0","1","1","1","0","0","1","0","1","1969","436","1996",,"1998",,"1998",,"1","2","3","1","1",,"1","1","9","2","2","0","2","2","400","500","500","4","400","100","3000","6","6",,,"41","1200","0","0","1","0","0","0","1","0","0","0","0",,,,,,,"7",,"4","2","2","1","1","1","1","1","3","1","1","1","1","2","2","2","2","1","2","4","3","5","1998","1","1","1998","1998","1998","2","2","0","2","2","450","4500","4500","450","150","1500","3500"
"45","45","45","1.65968734195782","1.1119905191117394","12","12","3","12026","11","1","0","0","1","1","1","1","0","0","0","1","0","1","1967","423","1997",,"2000",,"2004",,"1","2","3","10","2","2","1","2","2","1","0","1","0","0","350","400","300","2","200","200","3000","4","4",,,"1","1150","0","0","0","1","0","0","0","1","0","0","0",,,,,,,"6",,"2","3","4","2","1","1",,,,,,,,,,,,,,"1","4","5","1998","1","1","1998","2000","2004","0","1","1","0","0","450","450","300","300","300","1500","3500"
"46","46","46","0.604803675237121","0.4052184624088711","12","12","3","12026","11","1","0","1","1","1","1","0","1","1","0","1","0","1","1968","401","1995",,"1999",,"1999",,"1","2","3","1","1",,"1","1","9","2","2","0","2","2","450","500","400","4","200","400","2500","6","6",,,"41","1450","0","1","0","0","0","0","1","0","0","0","0",,,,,,,"6",,"3","2","4","3","1","1",,,,,,,,,,,,,,"4","3","5","1995","1","1","1995","1999","1999","2","2","0","2","2","450","4500","450","300","450","1500","2500"