"cod_ques","pesi_reg","pesi_gen","interv","comune","prov","prov2","sesso","anno_nas","cittad","stato_ci","religion","istruz","tipo_ist","corsi_pr","perm_sog","tipo_p_s","visto","arr_ita","arr_lom","arr_prov","anagrafe","alloggio","conviv","naz_con","fg_tot","fg_conv","fg_it","fg_it_mi","n_conv","safare1","safare2","safare3","safare4","cond_la1","cond_la2","lavoro","reddito","trov_lav","n_lav","temp_lav","trasfer","temp_tra","serv_1","serv_2","serv_3","serv_4","serv_5","serv_6","serv_7","serv_8","serv_9","serv_10","serv_11","serv_12","serv_13","serv_14","serv_15","serv_16","serv_17","imp_part","partec1","partec2","partec3","partec4","partec5","informaz","in_mt_cv","na_cg_cv","ar_cg_cv","eta_1fg","luog_1fg","eta_2fg","luog_2fg","eta_3fg","luog_3fg","eta_4fg","luog_4fg","eta_5fg","luog_5fg","eta_6fg","luog_6fg","eta_7fg","luog_7fg","progetti","ricon_fa","cla_istr","sa_lav1","sa_lav2","sa_lav3","sa_lav4","cla_lav","eta","cla_eta","cla_citt","cla_ita","cla_lom","cla_prov","cla_red","cla_ftot","cla_fcon","cla_fit","cla_fitm","cla_nlav","eta2","cla_eta2","cl_arrco"
"12001","0.7521","1.09","2,00","12127","12","12","1","63","404","4","2","4","1011","1","2","2","2","98","98","98","1","2","1",,"0","0","0","0","1","15",,,,"4",,"65","1200","1","1","2","1",,"3","3","1","1","2","1","1","1","1","1","1","3","3","3","3","2","3","2",,,,,,"3",,,,,,,,,,,,,"100",,,,,"6",,"18","39",,,,"11","38","5","4","4","4","4","3","0","0","0","0","1",,,
"12002","1.0143","1.47","2,00","12127","12","12","2","84","516","1","1","3","99","1","2","1","3","2001","2001","2001","1","2","6",,"0","0","0","0","4","15","14",,,"1",,"1","0",,"0",,"3","1","2","2","1","1","1","2","1","1","1","1","1","3","3","3","3","2","3","1","1","1","99","99","99","3",,,,,,,,,,,,,"100",,,,,"5",,"99","39","35",,,"1","17","1","5","7","7","7","0","0","0","0","0","0",,,
"12003","0.3657","0.53","2,00","12127","12","12","1","84","404","1","1","2",,"1","2","1","3","98","98","98","1","2","6",,"0","0","0","0","5","17","34",,,"1",,"1","0",,"1",,"1",,"3","3","1","1","2","1","1","1","1","1","1","3","3","3","2","2","3","2",,,,,,"3",,,,,,,,,,,,,"100",,,,,"6",,,"38","9",,,"1","17","1","4","4","4","4","0","0","0","0","0","1",,,
"12004","0.5451","0.79","3,00","12133","12","12","1","77","463","1","1","3","13","3","2","5","7","2001","2001","2001","5","9","1",,"1","0","0","0","1","208",,,,,"8","300","200","1","1","1","1",,"1","1","1","1","1","1","1","1","1","1","1","3","3","3","3","2","3","3",,,,,,"1",,,,"3","3",,,,,,,,"100",,,,,,,"4","21",,,,"35","24","2","4","7","7","7","1","1","0","0","0","1",,,
"12005","0.9522","1.38","3,00","12133","12","12","2","67","436","2","2","4","1007","2","2","1","3","99","99","99","1","2","2","1","0","0","0","0","2","14",,,,"3",,"1","0",,"99",,"1",,"3","3","1","1","3","1","1","1","1","1","1","3","3","3","3","2","3","1","1","99","99","1","1","4","97","62","90",,,,,,,,,,"100",,,,,,,"22","35",,,,"1","34","4","3","5","5","5","0","0","0","0","0","4","39","5","2"
"12006","0.6417","0.93","3,00","12133","12","12","1","55","201","2","3","4","1010","1","2","2","1","90","90","90","1","2","2","2","1","1","1","1","2","99",,,,"6",,"56","1800","3","2","4","1",,"3","3","99","3","3","2","3","1","1","3","1","2","3","3","3","3","3","1","1","1","1","1","1","2","95","63",,"3","1",,,,,,,,"100",,,,,,,"17","99",,,,"30","46","7","1","2","2","2","4","1","1","1","1","2","38","5",
"12007","0.5175","0.75","3,00","12123","12","12","2","80","235","4","3","3","14","3","2","5","7","2000","2001","2001","1","10","10",,"1","1","1","1","3","99",,,,"7",,"46","1500","4","0","1","1",,"1","1","1","1","1","1","2","1","1","1","1","3","3","3","3","2","3","1","99","99","99","99","1","4",,,,"5","2",,,,,,,,"100",,,,,"1",,"5","99",,,,"19","21","2","1","6","7","7","3","1","1","1","1","0",,,
"12008","0.6072","0.88","3,00","12133","12","12","2","74","201","2","2","3","14","3","2","6","7","2000","2001","2001","5","2","4","1","2","2","2","2","6","52",,,,"7",,"108","1000","3","2","2","2","1","3","3","99","3","1","3","1","1","1","1","1","3","3","3","2","2","3","1","1","99","99","1","1","3","91","64","2000","7","2","1","1",,,,,,"100",,,,,,,"5","34",,,,"24","27","3","1","6","7","7","2","2","2","2","2","2","37","5","6"
"12009","0.9039","1.31","2,00","12127","12","12","2","73","436","1","2","4","1055","1","2","2","2","2000","2000","2000","1","2","6",,"0","0","0","0","3","14","23",,,"5",,"46","800","3","3","1","3","1","3","3","1","1","2","1","1","1","1","1","1","3","3","3","3","2","3","1","99","1","99","1","99","2",,,,,,,,,,,,,"100",,,,,"6",,"20","35","35",,,"19","28","3","3","6","6","6","2","0","0","0","0","3",,,
"12010","0.5451","0.79","2,00","12127","12","12","1","68","344","2","2","2",,"3","2","2","2","97","98","98","1","5","6","1","2","0","0","0","10","10","34","21",,"6",,"77","2000","2","2","2","1",,"3","3","1","1","2","1","3","1","1","1","1","3","3","3","3","2","3","1","99","1","99","1","99","3","95","72",,"4","2","2","2",,,,,,"100",,,,,,"3",,"30","9","30",,"11","33","4","2","4","4","4","4","2","0","0","0","2","29","3",
"12011","1.3248","1.92","2,00","12127","12","12","2","62","426","4","1","2",,"2","1","2","5","87","87","87","1","2","1",,"2","2","2","1","1","6","18",,,"5",,"18","1500","3","2","2","1",,"3","3","3","99","99","99","3","99","99","99","99","2","2","2","2","2","2","1","1","1","99","1","99","3","80","58",,"19","2","17","2",,,,,,"100",,,,,"5",,,"18","38",,,"38","39","5","4","1","1","1","3","2","2","2","1","2","43","6",
"12012","2.1942","3.18","2,00","12127","12","12","2","86","436","1","2","2",,"3","3",,"7","2001","2001","2001","5","2","6",,"0","0","0","0","6","33","104",,,"1",,"1","0",,"2",,"1",,"3","2","1","1","1","1","1","1","1","1","1","99","99","99","99","2","99","3",,,,,,"3",,,,,,,,,,,,,"100",,,,,"1",,,"6","35",,,"1","15","1","3","7","7","7","0","0","0","0","0","2",,,
"12013","0.3657","0.53","3,00","12133","12","12","1","77","311","2","4","4","1010","3","2","2","2","2000","2000","2000","1","11","1","1","2","0","0","0","1","99",,,,"6",,"66","1400","2","1","2","1",,"1","1","1","1","1","1","1","1","1","1","1","99","99","99","99","2","99","1","99","99","99","99","1","3","91","77",,"10","2","1","2",,,,,,"100",,,,,,"3","17","99",,,,"23","24","2","2","6","6","6","3","2","0","0","0","1","24","2",
"12014","0.8694","1.26","3,00","12133","12","12","2","71","609","4","1","4","1012","3","3",,"1","99","99","99","5","11","1",,"1","0","0","0","1","25",,,,"7",,"35","1500","2","2","2","1",,"3","2","1","1","1","3","3","1","1","1","1","3","3","3","3","3","3","1","1","1","1","1","1","2",,,,"7","2",,,,,,,,"100",,,,,"6",,"21","6",,,,"33","30","4","5","5","5","5","3","1","0","0","0","2",,,
"12015","0.6141","0.89","3,00","12123","12","12","2","78","254","1","3","3","99","3","2","5","7","2000","2000","2001","5","10","10",,"0","0","0","0","3","46","43","21",,,"8","115","1500","2","0","1","1",,"2","2","1","1","1","1","3","1","1","2","1","3","3","3","3","2","3","1","1","99","99","99","1","3",,,,,,,,,,,,,"100",,,,,"1",,"99","19","38","30",,"19","23","2","1","6","6","7","3","0","0","0","0","0",,,
"12016","0.4554","0.66","3,00","12123","12","12","2","70","201","2","2","4","1055","3","2","1","3","98","2000","2000","1","2","2","1","0","0","0","0","2","3","33","302",,"9",,"53","800","2","6","1","1",,"3","3","1","99","2","1","1","99","99","2","99","3","3","3","3","2","3","1","1","1","1","1","1","2","97","61","96",,,,,,,,,,"100",,,,,,,"20","35","6","7",,"35","31","4","1","4","6","6","2","0","0","0","0","4","40","6","4"
"12017","0.3657","0.53","3,00","12133","12","12","1","67","609","4","1","4","1016","3","2","5","1","2001","2001","2001","5","6","10",,"1","0","0","0","3","104",,,,"1",,"1","0",,"0",,"1",,"1","1","1","1","1","1","1","1","1","1","1","3","3","3","3","2","3","1","1","1","1","1","1","3",,,,"5","2",,,,,,,,"100",,,,,"6",,"18","35",,,,"1","34","4","5","7","7","7","0","1","0","0","0","0",,,
"12018","0.6693","0.97","3,00","12133","12","12","1","74","201","1","2","3","8","3","3",,"7","98","2000","2000","5","2","6",,"0","0","0","0","2","14",,,,"7",,"21","2000","2","2","2","1",,"3","1","1","1","2","2","2","1","1","1","1","3","3","3","3","3","3","1","1","1","1","1","1","2",,,,,,,,,,,,,"100",,,,,"1",,"8","35",,,,"30","27","3","1","4","6","6","4","0","0","0","0","2",,,
"12019","1.2075","1.75","6,00","12070","12","12","2","61","517","2","1","2",,"1","2","2","7","94","94","94","1","11","1","1","2","0","2","2","1","6",,,,"6",,"35","1600","2","4","3","1",,"3","3","1","2","1","1","1","1","1","3","1","3","3","2","3","3","3","1","99","1","99","99","99","3","81","59","97","17","2","9","2",,,,,,"100",,,,,,"4",,"18",,,,"33","40","6","5","3","3","3","4","2","0","2","2","4","42","6","4"
"12020","0.9246","1.34","6,00","12046","12","12","2","67","361","4","1","4","1080","3","3",,"1","98","98","99","5","11","1",,"1","0","0","0","1","52",,,,"7",,"35","1600","2","3","2","1",,"3","1","1","1","1","1","1","1","1","2","1","3","3","3","3","3","3","2",,,,,,"3",,,,"10","2",,,,,,,,"100",,,,,"5",,"12","34",,,,"33","34","4","2","4","4","5","4","1","0","0","0","3",,,
"12021","0.6348","0.92","6,00","12046","12","12","1","65","348","2","2","2",,"1","2","2","7","90","90","90","1","2","2","1","1","1","1","1","2","4",,,,"6",,"4","2500","1","2","4","1",,"3","3","1","3","1","2","3","1","1","1","3","3","3","3","3","2","3","1","1","2","1","1","1","3","97","75","97","2","1",,,,,,,,"100",,,,,,"4",,"11",,,,"11","36","5","2","2","2","2","5","1","1","1","1","2","26","3","4"
"12022","0.4416","0.64","6,00","12046","12","12","1","68","602","1","1","2",,"2","2","2","1","88","88","88","1","2","1",,"0","0","0","0","1","34",,,,"6",,"4","2000","2","3","4","6","99","3","3","1","1","1","2","3","1","1","1","1","3","3","3","2","3","3","3",,,,,,"3",,,,,,,,,,,,,"100",,,,,"2",,,"9",,,,"11","33","4","5","1","1","1","4","0","0","0","0","3",,,
"12023","0.3657","0.53","6,00","12127","12","12","1","84","404","1","1","1",,"1","2","1","3","97","99","99","1","2","6",,"0","0","0","0","4","17",,,,"2",,"1","0",,"99",,"1",,"3","3","1","3","1","1","1","1","1","1","1","3","2","2","3","2","3","2",,,,,,"3",,,,,,,,,,,,,"100",,,,,"2",,,"38",,,,"1","17","1","4","4","5","5","0","0","0","0","0","4",,,
"12024","0.3657","0.53","6,00","12127","12","12","1","81","314","1","4","2",,"1","2","1","3","98","98","98","2","2","6",,"0","0","0","0","4","2",,,,"2",,"1","0",,"99",,"1",,"3","3","1","1","1","1","1","1","1","99","1","3","3","2","3","2","3","1","99","1","99","99","99","3",,,,,,,,,,,,,"100",,,,,"2",,,"22",,,,"1","20","2","2","4","4","4","0","0","0","0","0","4",,,
"12025","0.3657","0.53","6,00","12127","12","12","1","79","305","1","2","2",,"1","2","2","7","98","98","99","2","2","6",,"0","0","0","0","4","38",,,,"6",,"4","1200","3","3","2","1",,"3","3","1","1","1","1","1","1","1","1","1","3","3","3","3","2","3","1","99","1","99","1","99","3",,,,,,,,,,,,,"100",,,,,"2",,,"5",,,,"11","22","2","2","4","4","5","3","0","0","0","0","3",,,
"12026","0.7452","1.08","6,00","12127","12","12","2","61","605","1","1","2",,"1","2","2","1","90","90","92","1","2","3","2","1","1","1","1","2","49",,,,"6",,"4","1300","3","6","2","1",,"3","3","1","3","2","1","99","1","1","2","1","3","3","2","3","2","3","1","99","1","99","1","99","3","97","59",,"14","2",,,,,,,,"100",,,,,,,,"28",,,,"11","40","6","5","2","2","2","3","1","1","1","1","4","42","6",
"12027","1.3317","1.93","4,00","12133","12","12","2","68","233","2","1","4","99","3","2","4","1","2000","2000","2000","1","6","10","1","0","0","0","0","2","14",,,,"2",,"1","0",,"1",,"6","2","3","3","1","1","1","1","1","1","1","1","1","3","3","3","3","1","3","1","1","99","99","99","99","2","97","67",,,,,,,,,,,"100",,,,,,"4","99","35",,,,"1","33","4","1","6","6","6","0","0","0","0","0","1","34","4",
"12028","1.4559","2.11","4,00","12133","12","12","2","50","245","2","3","2",,"3","2","1","3","98","98","98","2","1","4","2","2","0","0","0","4","52",,,,"3","2","1","0",,"0",,"1",,"3","2","1","1","1","1","1","1","3","1","1","3","3","3","3","1","3","1","99","1","99","99","99","3","98","38",,"17","2","14","2",,,,,,"100",,,,,,"3",,"34",,,,"1","51","8","1","4","4","4","0","2","0","0","0","0","63","10",
"12029","1.2006","1.74","4,00","12076","12","12","1","72","436","1","2","1",,"1","2","3","7","97","99","2001","2","5","9",,"0","0","0","0","3","34",,,,"11","8","28","1500","2","5","3","1",,"3","3","1","1","1","1","1","1","1","1","1","3","3","3","3","3","3","1","99","1","99","99","99","4",,,,,,,,,,,,,"100",,,,,"6",,,"9",,,,"17","29","3","3","4","5","7","3","0","0","0","0","4",,,
"12030","1.1661","1.69","4,00","12133","12","12","2","79","515","1","1","2",,"1","2","1","3","99","99","99","1","2","6",,"0","0","0","0","4","303",,,,"2",,"1","0",,"2",,"1",,"3","3","99","99","99","99","99","99","99","99","99","99","99","99","99","1","99","1","1","99","99","99","99","3",,,,,,,,,,,,,"100",,,,,"3",,,"28",,,,"1","22","2","5","5","5","5","0","0","0","0","0","2",,,
"12031","0.4485","0.65","4,00","12092","12","12","1","69","314","1","7","2",,"1","2","1","3","2001","2001","2001","1","2","6",,"0","0","0","0","5","303",,,,"6",,"46","1000","2","0","2","1",,"3","3","1","1","1","1","1","1","1","1","1","3","3","3","3","2","3","2",,,,,,"1",,,,,,,,,,,,,"100",,,,,"1",,,"28",,,,"19","32","4","2","7","7","7","2","0","0","0","0","0",,,
"12032","1.4559","2.11","4,00","12092","12","12","2","67","244","2","3","3","14","3","2","1","3","96","96","96","1","1","4","2","2","2","2","2","5","14",,,,"3",,"1","0",,"0",,"1",,"3","3","99","99","3","99","99","99","3","3","99","2","2","2","3","3","3","2",,,,,,"3","96","68",,"12","2","1",,,,,,,"100",,,,,,,"5","35",,,,"1","34","4","1","4","4","4","0","2","2","2","2","0","33","4",
"12033","0.4485","0.65","4,00","12092","12","12","2","74","314","2","7","3","7","1","2","3","3","96","96","96","1","2","4","1","1","1","1","1","5","304",,,,"10",,"305","3000","2","3","3","1",,"3","3","1","1","1","1","1","1","1","1","1","3","3","3","3","2","99","3",,,,,,"2","98","67","2001","1","1",,,,,,,,"100",,,,,,,"1","35",,,,"18","27","3","2","4","4","4","5","1","1","1","1","3","34","4","7"
"12034","0.5589","0.81","4,00","12133","12","12","1","73","323","1","3","3","3","3","2","1","3","2000","2000","2000","2","2","6",,"0","0","0","0","99","33",,,,,"7","42","600","2","0","2","2","3","2","3","1","1","1","1","1","1","1","1","1","99","99","99","99","1","99","1","99","99","99","99","1","4",,,,,,,,,,,,,"100",,,,,"1",,"2","6",,,,"20","28","3","2","6","6","6","2","0","0","0","0","0",,,
"12035","0.5451","0.79","1,00","12026","12","12","1","70","327","2","2","3","14","2","2","2","4","89","90","90","2","1","2","1","3","3","3","3","2","306",,,,"6",,"307","1850","5","2","4","1",,"3","3","1","3","1","3","3","1","1","2","1","2","2","2","1","2","99","1","1","1","1","1","1","2","91","69","91","9","1","6","1","4","1",,,,"100",,,,,,,"5","38",,,,"38","31","4","2","1","2","2","4","3","3","3","3","2","32","4","2"
"12036","0.4416","0.64","1,00","12026","12","12","1","68","419","2","2","2",,"2","2","2","4","88","88","94","1","2","2","2","0","0","0","0","2","308",,,,"6",,"308","1900","1","4","4","1",,"3","3","1","1","2","2","1","1","1","1","1","3","3","3","2","2","99","1","2","1","1","1","1","3","2000","61",,,,,,,,,,,"100",,,,,,,,"28",,,,"28","33","4","3","1","1","3","4","0","0","0","0","4","40","6",
"12037","0.4968","0.72","1,00","12026","12","12","2","66","323","2","1","2",,"1","2","1","3","99","99","99","2","1","2","2","0","0","0","0","2","99",,,,"3",,"1","0",,"0",,"1",,"3","3","1","1","1","2","2","1","1","1","1","3","3","3","3","2","99","1","2","1","2","2","1","3","98","64",,,,,,,,,,,"100",,,,,,,,"99",,,,"1","35","5","2","5","5","5","0","0","0","0","0","0","37","5",
"12038","0.3657","0.53","1,00","12026","12","12","1","83","609","1","3","3","14","2","2","1","3","2000","2000","2000","1","2","6",,"0","0","0","0","3","48",,,,,"8","48","600","2","1","1","1",,"3","3","1","1","1","1","1","1","1","1","1","3","3","3","2","2","99","3",,,,,,"3",,,,,,,,,,,,,"100",,,,,"6",,"5","18",,,,"18","18","1","5","6","6","6","2","0","0","0","0","1",,,
"12039","0.6693","0.97","1,00","12026","12","12","1","83","436","1","2","2",,"1","2","1","3","2000","2000","2000","1","1","6",,"0","0","0","0","6","99",,,,"1",,"1","0",,"0",,"1",,"3","3","2","1","1","1","1","1","1","1","1","3","3","2","3","2","99","3",,,,,,"4",,,,,,,,,,,,,"100",,,,,"6",,,"99",,,,"1","18","1","3","6","6","6","0","0","0","0","0","0",,,
"12040","0.5244","0.76","1,00","12026","12","12","1","83","201","1","2","2",,"1","2","1","3","2000","2000","2000","1","2","6",,"0","0","0","0","4","99",,,,"2",,"1","0",,"99",,"1",,"3","3","1","1","1","1","1","1","1","1","1","3","3","3","3","2","99","2",,,,,,"1",,,,,,,,,,,,,"100",,,,,"3",,,"99",,,,"1","18","1","1","6","6","6","0","0","0","0","0","4",,,
"12041","0.5865","0.85","1,00","12026","12","12","2","80","518","1","3","3","14","2","2","4","4","2000","2000","2000","2","5","10",,"0","0","0","0","4","99",,,,"2",,"1","0",,"0",,"6","3","3","1","1","1","1","1","1","1","1","2","1","3","3","3","2","2","99","1","1","1","1","1","1","3",,,,,,,,,,,,,"100",,,,,"6",,"5","99",,,,"1","21","2","5","6","6","6","0","0","0","0","0","0",,,
"12042","0.5865","0.85","1,00","12026","12","12","2","74","404","2","1","1",,"1","2","1","3","2000","2000","2000","1","1","2","2","1","0","0","0","2","99",,,,"3",,"1","0",,"0",,"1",,"3","3","1","1","1","1","1","1","1","1","1","3","3","3","3","2","99","3",,,,,,"5","99","60",,"8","2",,,,,,,,"100",,,,,,"2",,"99",,,,"1","27","3","4","6","6","6","0","1","0","0","0","0","41","6",
"12043","0.5037","0.73","1,00","12026","12","12","2","64","201","2","2","1",,"1","2","1","3","99","99","99","1","2","2","1","2","2","2","2","2","99",,,,"3",,"1","0",,"0",,"2","1","3","3","2","1","1","1","2","1","1","1","1","3","3","2","3","2","99","1","1","1","1","1","1","3","86","64","92","9","2","11","2",,,,,,"100",,,,,,,,"99",,,,"1","37","5","1","5","5","5","0","2","2","2","2","0","37","5","2"
"12044","0.4968","0.72","1,00","12026","12","12","2","72","201","2","2","4","1055","1","2","1","3","98","98","98","1","10","2","1","2","2","2","2","2","14",,,,"3",,"1","0",,"0",,"1",,"3","3","1","3","99","2","3","1","1","1","1","3","3","3","3","2","99","1","1","1","1","1","1","3","97","61","90","3","1","1","1",,,,,,"100",,,,,,,"20","35",,,,"1","29","3","1","4","4","4","0","2","2","2","2","0","40","6","2"
"12045","0.3657","0.53","5,00","12119","12","12","1","70","330","2","1","3","7","1","2","2","2","2000","2000","2000","4","5","9","1","2","0","0","0","4","4",,,,"6",,"4","1300","2","1","2","1",,"3","2","1","1","1","1","1","1","1","1","1","3","3","3","3","3","3","1","1","1","99","1","99","3","95","72",,"4","2","2","2",,,,,,"100",,,,,,"1","1","11",,,,"11","31","4","2","6","6","6","3","2","0","0","0","1","29","3",
"12046","0.4485","0.65","5,00","12119","12","12","1","74","460","1","2","4","1010","2","2","2","2","96","96","96","1","2","1",,"0","0","0","0","1","309",,,,"6",,"21","1400","2","2","3","1",,"3","3","1","1","1","1","1","1","1","1","1","3","3","3","3","3","3","1","1","1","1","1","99","2",,,,,,,,,,,,,"100",,,,,"1",,"17","5",,,,"30","27","3","3","4","4","4","3","0","0","0","0","2",,,
"12047","0.5727","0.83","5,00","12119","12","12","1","70","460","1","2","3","14","2","2","2","2","90","90","99","4","5","9",,"0","0","0","0","4","115",,,,"1",,"1","0",,"3",,"4","99","1","3","1","1","1","1","1","1","1","1","1","1","3","3","3","3","3","1","1","1","1","1","99","3",,,,,,,,,,,,,"100",,,,,"3",,"5","19",,,,"1","31","4","3","2","2","5","0","0","0","0","0","3",,,
"12048","0.4485","0.65","5,00","12119","12","12","1","74","330","1","1","4","1014","2","2","2","2","99","99","99","4","2","6",,"0","0","0","0","3","25",,,,"6",,"43","1600","2","2","2","1",,"2","2","3","3","3","3","3","3","3","3","3","3","3","3","3","3","3","1","1","1","99","1","99","2",,,,,,,,,,,,,"100",,,,,"1",,"9","6",,,,"38","27","3","2","5","5","5","4","0","0","0","0","2",,,
"12049","0.5658","0.82","5,00","12133","12","12","1","73","330","2","6","2",,"1","2","2","2","95","95","96","2","2","2","1","1","0","1","1","2","34",,,,"6",,"4","1500","3","3","3","1",,"3","3","1","3","1","1","1","1","1","1","1","3","3","3","3","3","3","1","1","1","99","1","99","3","99","76","2000","1","1",,,,,,,,"100",,,,,,,,"9",,,,"11","28","3","2","3","3","4","3","1","0","1","1","3","25","3","6"
"12050","0.4347","0.63","5,00","12133","12","12","1","70","311","2","4","2",,"1","2","2","2","94","94","94","2","2","2","1","2","0","0","0","2","4",,,,"6",,"4","1400","3","3","3","1",,"3","3","1","1","1","1","1","1","1","1","1","3","3","3","3","3","3","1","99","1","99","1","99","3","95","74","99","4","2","3","2",,,,,,"100",,,,,,"2",,"11",,,,"11","31","4","2","3","3","3","3","2","0","0","0","3","27","3","5"
"12051","0.414","0.6","5,00","12133","12","12","1","72","344","1","2","3","3","1","2","2","1","97","97","97","3","6","10",,"0","0","0","0","4","25",,,,"4",,"4","1400","2","2","2","3","2","3","3","1","1","1","1","1","1","1","1","1","3","3","3","3","3","3","1","1","1","99","1","99","3",,,,,,,,,,,,,"100",,,,,"1",,"2","6",,,,"11","29","3","2","4","4","4","3","0","0","0","0","2",,,
"12052","0.5106","0.74","5,00","12133","12","12","2","58","311","2","1","1",,"1","2","2","2","90","90","90","2","11","2","1","3","0","0","0","2","18",,,,"4",,"99","1300","2","4","2","1",,"2","3","1","1","1","1","1","1","1","1","1","3","3","3","3","3","3","3",,,,,,"1","83","57","99","15","2","13","2","12","2",,,,"100",,,,,,"4",,"38",,,,"99","43","6","2","2","2","2","3","3","0","0","0","4","44","6","5"
"12053","0.3657","0.53","4,00","12092","12","12","1","76","314","1","7","2",,"1","2","2","2","99","99","99","1","11","10",,"0","0","0","0","99","46",,,,"6",,"4","1000","2","0","3","1",,"2","1","1","1","1","1","1","1","1","1","2","3","3","3","3","3","2","3",,,,,,"1",,,,,,,,,,,,,"100",,,,,"1",,,"19",,,,"11","25","3","2","5","5","5","2","0","0","0","0","0",,,
"12054","0.6762","0.98","4,00","12092","12","12","1","71","311","1","5","2",,"3","2","2","2","98","98","98","1","11","9",,"0","0","0","0","3","34",,,,"6",,"34","1400","5","0","4","1",,"3","3","1","1","1","1","1","1","1","1","1","3","3","3","3","3","3","2",,,,,,"1",,,,,,,,,,,,,"100",,,,,"2",,,"9",,,,"9","30","4","2","4","4","4","3","0","0","0","0","0",,,
"12055","0.6762","0.98","4,00","12092","12","12","1","68","311","2","7","2",,"3","2","2","2","99","99","99","1","11","9","1","1","0","0","0","3","4",,,,"6",,"2","1400","2","0","3","1",,"3","3","3","2","2","2","2","2","2","2","2","3","3","3","3","3","3","1","1","2","2","2","2","2","93","70",,"7","2",,,,,,,,"100",,,,,,"3",,"11",,,,"22","33","4","2","5","5","5","3","1","0","0","0","0","31","4",
"12056","0.7866","1.14","4,00","12092","12","12","1","62","460","2","2","2",,"1","2","2","7","96","97","98","1","2","4","1","1","0","0","0","4","4",,,,"6",,"4","1300","4","4","3","1",,"3","3","2","2","1","1","1","1","1","1","1","3","3","3","3","3","3","1","99","99","99","1","99","3","94","70","98","4","2",,,,,,,,"100",,,,,,,,"11",,,,"11","39","5","3","4","4","4","3","1","0","0","0","4","31","4","4"
"12057","1.4559","2.11","4,00","12092","12","12","2","71","411","2","1","1",,"1","3",,"3","2001","2001","2001","5","6",,"1","1","1","1","1","4","46",,,,"3",,"1","0",,"0",,"1",,"2","1","1","1","1","1","1","1","1","1","1","3","3","3","3","3","3","3",,,,,,"5","96","67","98","4","2",,,,,,,,"100",,,,,,,,"19",,,,"1","30","4","4","7","7","7","0","1","1","1","1","0","34","4","4"
"12058","0.4485","0.65","4,00","12092","12","12","1","67","314","2","4","2",,"1","2","1","3","2001","2001","2001","1","2","5","1","1","1","1","1","6","9",,,,"6",,"46","1000","2","0","2","6","3","3","3","3","3","1","1","1","1","1","1","1","3","3","3","3","2","3","2",,,,,,"5","98","74","96","1","1",,,,,,,,"100",,,,,,,,"15",,,,"19","34","4","2","7","7","7","2","1","1","1","1","0","27","3","4"
"12059","1.4559","2.11","4,00","12092","12","12","1","72","436","1","2","2",,"3","2","2","7","96","98","98","2","6","9",,"0","0","0","0","4","42",,,,"6",,"4","1400","4","4","3","2","1","3","3","2","1","2","1","1","1","1","1","1","3","3","3","3","3","3","1","1","99","99","99","99","2",,,,,,,,,,,,,"100",,,,,"1",,,"20",,,,"11","29","3","3","4","4","4","3","0","0","0","0","4",,,