"pesiprov","pesireg","prov","prov2","nq","ril","naz_ril","comune","luogo_ri","genere","nascita","naz","reg_alb","st_civ","relig","studio1","studio2","pds","sanat1","sanat2","sanat3","sanat4","sanat5","sanat6","sanat7","tipo_pds","visto","arr_ita","arr_lomb","arr_prov","rete","anagrafe","alloggio","con_vive","figli_to","figli_it","figli_co","figli_cm","gen_f1","eta_f1","luogo_f1","arriv_f1","gen_f2","eta_f2","luogo_f2","arriv_f2","gem_f3","eta_f3","luogo_f3","arriv_f3","scuo_f1","temp_f1","ling_f1","opp_f1","scuo_f2","temp_f2","ling_f2","opp_f2","scuo_f3","temp_f3","ling_f3","opp_f3","naz_cg","cond_la1","cond_la2","lavoro","reddito","prost","inganno","violenza","volont","eta","cla_eta","cla_citt","cla_ita","cla_lom","cla_prov","cla_red","cla_fto","cla_fit","cla_fco","cla_fcm","conviven","ha_figli","carta_sg","maggiore"
"0.5116218615","0.31574377736","12","12","1","1","615","12026","12","1","1978","305",,"1","2","2","2","2",,,,,,"1",,"2","1","1999","1999","1999","4","1","2",,"0","0","0","0",,"99",,"99",,"99",,"99",,"99",,"99",,,,,,,,,,,,,,"6",,"1","850","1","1","3","1","25","3","2","5","5","5","4","0","0","0","0","0","0","0","1"
"1.6351261634","1.00910643224","12","12","2","1","615","12026","12","1","1981","436",,"1","2","1","1","7",,,,,,"1",,,"1","2002","2002","2002","3",,"12","7","0","0","0","0",,"99",,"99",,"99",,"99",,"99",,"99",,,,,,,,,,,,,,"6",,"32","950","1","1","1","1","22","2","3","8","8","8","4","0","0","0","0","0","0","0","1"
"1.3066714919","0.80640297787","12","12","3","1","615","12026","12","1","1979","436",,"1","2","2","5","7",,,,,,"1",,,"1","2001","2001","2001","4",,"12","7","0","0","0","0",,"99",,"99",,"99",,"99",,"99",,"99",,,,,,,,,,,,,,"6",,"32","950","1","1","1","1","24","2","3","7","7","7","4","0","0","0","0","0","0","0","1"
"0.5116218615","0.31574377736","12","12","4","1","615","12026","12","2","1958","609",,"1","1","2","5","2",,,,,"1",,,"2","1","1996","1996","1996","1","2","3","8","1","1","1","1","2","15","2","2001",,"99",,"99",,"99",,"99","1","2","99","99",,,,,,,,,,"5",,"15","500","1","1","1","1","45","7","5","4","4","4","2","1","1","1","1","0","1","0","1"
"0.6050723117","0.37341605523","12","12","5","1","615","12026","11","2","1973","615",,"1","1","3","5","1",,,,"1",,,,"2","1","1993","1993","1993","3","2","2","3","0","0","0","0",,"99",,"99",,"99",,"99",,"99",,"99",,,,,,,,,,,,,"3","5",,"17","600","1","1","3","1","30","4","5","3","3","3","3","0","0","0","0","1","0","1","1"
"0.5116218615","0.31574377736","12","12","6","1","615","12026","12","1","1976","404",,"1","2","2","5","2",,,,,"1",,,"2","1","1997","1998","1998","7","1","2",,"0","0","0","0",,"99",,"99",,"99",,"99",,"99",,"99",,,,,,,,,,,,,,"6",,"115","900","2",,,,"27","3","4","4","4","4","4","0","0","0","0","0","0","0","1"
"0.8605927176","0.53110864855","12","12","7","1","615","12070","12","2","1969","453",,"2","2","2","5","2","1",,,,,,,"1","4","1998","1998","1998","2","1","2","10","1","1","1","1","1","6","2","1998",,"99",,"99",,"99",,"99","1","2","99","99",,,,,,,,,"1","7",,"15","400","99",,,,"34","4","4","4","4","4","2","1","1","1","1","1","1","0","1"
"1.9722410524","1.21715447807","12","12","8","1","615","12070","12","1","1971","436",,"2","2","2","5","99",,,,,,,"1","99","99","2002","2002","2002","4","5","12","7","2","0","0","0",,"99",,"99",,"99",,"99",,"99",,"99",,,,,,,,,,,,,"1","7",,"32","1200","1","1","1","1","32","4","3","8","8","8","5","2","0","0","0","0","0","99","1"
"0.8605927176","0.53110864855","12","12","9","1","615","12070","11","2","1975","243",,"1","1","3","5","7",,,,,,"1",,,"1","2001","2001","2001","7",,"4","4","0","0","0","0",,"99",,"99",,"99",,"99",,"99",,"99",,,,,,,,,,,,,,"5",,"102","600","1","1","1","1","28","3","1","7","7","7","3","0","0","0","0","0","0","0","1"
"2.4692193882","1.52386110815","12","12","10","1","615","12070","12","1","1984","311",,"1","4","2","2","2","1",,,,,,,"2","4","1994","1994","1994","3","2","2","4","0","0","0","0",,"99",,"99",,"99",,"99",,"99",,"99",,,,,,,,,,,,,,"6",,"1","800","99",,,,"19","1","2","3","3","3","4","0","0","0","0","0","0","0","1"
"1.4442158595","0.89128750186","12","12","11","1","615","12070","12","1","1972","201","6","2","1","3","3","1",,,,"1",,,,"2","8","1993","1994","1994","1","2","2","2","0","0","0","0",,"99",,"99",,"99",,"99",,"99",,"99",,,,,,,,,,,,,"1","6",,"102","1400","1","1","1","1","31","4","1","3","3","3","5","0","0","0","0","1","0","1","1"
"0.5116218615","0.31574377736","12","12","12","1","615","12070","13","2","1967","609",,"2","1","3","5","2",,,,,"1",,,"2","1","1997","1997","1997","4","1","2",,"3","3","3","3","2","14","2","2002","1","11","2","2001","2","8","2","2001","1","2","1","99","2","1","2","1","2","3","1","2","1","5",,"15","600","1","1","1","1","36","5","5","4","4","4","3","3","3","3","3","1","1","0","1"
"0.7965223833","0.4915680994","12","12","13","1","615","12127","12","1","1958","619",,"2","1","3","5","1",,,,"1",,,,"2","1","1992","1992","1992","1","2","2","10","3","3","3","1","2","17","2","1999",,"99",,"99",,"99",,"99","1","1","99","99",,,,,,,,,"1","6",,"5","900","1","1","1","1","45","7","5","2","2","2","4","3","3","3","1","1","1","1","1"
"0.5224563484","0.32243020357","12","12","14","1","615","12127","13","2","1964","615",,"4","1","4","3","3","1",,,,,,,,"1","1992","1992","1992","4","1","1","9","1","1","1","1","1","8","1","99",,"99",,"99",,"99",,"99","1","1","99","99",,,,,,,,,"2","9","7","20","1000","1","1","1","1","39","5","5","2","2","2","4","1","1","1","1","1","1","0","1"
"0.7054776097","0.4353804677","12","12","15","1","615","12026","10","2","1973","323",,"2","1","2","5","3",,,,"1",,,,,"8","1994","1994","1994","1","2","1","9","1","1","1","1","2","4","1","99",,"99",,"99",,"99",,"99","2","1","99","99",,,,,,,,,"2","7",,"15","500","1","1","3","1","30","4","2","3","3","3","2","1","1","1","1","1","1","0","1"
"0.5116218615","0.31574377736","12","12","16","1","615","12026","11","1","1975","517",,"1","1","2","5","2",,,,,,"1",,"2","1","1998","1998","1998","3","2","1","10","1","1","1","1","1","0","1","99",,"99",,"99",,"99",,"99","2","1","99","99",,,,,,,,,"3","6",,"2","1100","1","1","3","1","28","3","5","4","4","4","5","1","1","1","1","1","1","0","1"
"0.6050723117","0.37341605523","12","12","17","1","615","12026","10","2","1969","615",,"2","1","4","3","3",,,,"1",,,,,"8","1993","1993","1993","3","2","1","9","1","1","1","1","2","3","1","99",,"99",,"99",,"99",,"99","1","1","99","99",,,,,,,,,"2","5",,"15","600","1","1","1","1","34","4","5","3","3","3","3","1","1","1","1","1","1","0","1"
"1.0548537271","0.650995443","12","12","18","1","615","12136","13","2","1978","436",,"2","2","1","1","2","1",,,,,,,"1","4","1999","1999","1999","2","1","2","9","1","1","1","1","1","3","1","99",,"99",,"99",,"99",,"99","2","1","99","99",,,,,,,,,"1","3",,,"0","1","1","1","3","25","3","3","5","5","5","0","1","1","1","1","1","1","0","1"
"0.5575656683","0.34409766958","12","12","19","1","615","12136","13","2","1970","344",,"2","2","2","5","2","1",,,,,,,"1","4","1999","1999","1999","2","1","2","9","4","4","4","4","1","10","2","1999","2","8","2","1999","1","3","1","99","1","1","2","99","1","1","1","2","2","1","2","1","1","3",,,"0","2",,,,"33","4","2","5","5","5","0","4","4","4","4","1","1","0","1"
"0.6877218379","0.42442261993","12","12","20","1","615","12136","13","2","1966","615",,"4","1","4","2","7",,,,,,"1",,,"1","1998","2002","2002","4",,"3","1","1","0","0","0",,"99",,"99",,"99",,"99",,"99",,"99",,,,,,,,,,,,,,"6",,"15","750","1","1","3","1","37","5","5","4","8","8","3","1","0","0","0","0","0","0","1"
"1.0380216065","0.64060762004","12","12","21","1","615","12136","13","2","1977","243",,"2","3","3","1","6","1",,,,,,,,"1","2002","2002","2002","3",,"11","1","1","0","0","0",,"99",,"99",,"99",,"99",,"99",,"99",,,,,,,,,,,,,"1","7",,"16","700","1","1","1","1","26","3","1","8","8","8","3","1","0","0","0","0","0","0","1"
"0.6050723117","0.37341605523","12","12","22","1","615","12136","11","1","1967","460",,"1","2","3","5","1",,,"1",,,,,"2","1","1989","1990","1990","1","2","6","5","0","0","0","0",,"99",,"99",,"99",,"99",,"99",,"99",,,,,,,,,,,,,"3","6",,"2","1100","1","1","3","1","36","5","3","1","2","2","5","0","0","0","0","1","0","1","1"
"0.6877218379","0.42442261993","12","12","23","1","615","12119","12","1","1949","615",,"2","1","3","5","2","1",,,,,,,"1","4","2001","2001","2001","7","2","2","8","5","3","2","0",,"99",,"99",,"99",,"99",,"99",,"99",,,,,,,,,,,,,"1","6",,"2","1200","1","1","3","1","54","8","5","7","7","7","5","4","3","2","0","0","1","0","1"
"0.9466519893","0.5842195134","12","12","24","1","615","12119","12","2","1977","323",,"1","1","2","5","7",,,,,,"1",,,"1","2000","2000","2000","3",,"2","4","0","0","0","0",,"99",,"99",,"99",,"99",,"99",,"99",,,,,,,,,,,,,,"6",,"15","800","1","1","1","1","26","3","2","6","6","6","4","0","0","0","0","0","0","0","1"
"1.2706518546","0.78417371598","12","12","25","1","615","12119","12","1","1972","201","6","1","1","3","5","1",,,,"1",,,,"2","8","1995","1995","1995","4","2","2","4","0","0","0","0",,"99",,"99",,"99",,"99",,"99",,"99",,,,,,,,,,,,,,"6",,"31","1500","1","1","1","1","31","4","1","3","3","3","5","0","0","0","0","0","0","1","1"
"0.5116218615","0.31574377736","12","12","26","9","436","12026","12","1","1974","443",,"2","3","3","2","2",,,,,"1",,,"2","1","1998","1998","1998","4","1","2","2","0","0","0","0",,"99",,"99",,"99",,"99",,"99",,"99",,,,,,,,,,,,,"1","4",,"2","1300","1","3","3","3","29","3","4","4","4","4","5","0","0","0","0","1","0","0","1"
"0.9564269498","0.59025206047","12","12","27","9","436","12026","8","2","1971","243",,"2","99","3","3","2",,,,,"1",,,"2","8","1996","1996","1996","4","5","2","2","0","0","0","0",,"99",,"99",,"99",,"99",,"99",,"99",,,,,,,,,,,,,"3","6",,"102","900","99",,,,"32","4","1","4","4","4","4","0","0","0","0","1","0","0","1"
"1.6351261634","1.00910643224","12","12","28","9","436","12026","12","1","1967","436",,"2","2","4","4","2","1",,,,,,,"1","4","2003","2003","2003","2","1","2","2","0","0","0","0",,"99",,"99",,"99",,"99",,"99",,"99",,,,,,,,,,,,,"1","6",,"31","1000","1","1","3","1","36","5","3","9","9","9","4","0","0","0","0","1","0","0","1"
"0.5116218615","0.31574377736","12","12","29","9","436","12026","3","1","1963","305",,"2","2","3","3","2",,"1",,,,,,"2","8","1985","1990","1996","1","1","2","9","1","1","1","1","1","1","1","99",,"99",,"99",,"99",,"99","2","1","99","99",,,,,,,,,"1","6",,"1","900","1","3","2","1","40","6","2","1","2","4","4","1","1","1","1","1","1","0","1"
"1.7143684071","1.05801021694","12","12","30","9","436","12026","3","1","1966","436",,"2","2","3","3","3","1",,,,,,,,"2","1990","1990","1990","3","1","1","9","2","2","2","2","2","7","1","99","1","5","1","99",,"99",,"99","1","1","1","99","99","1","1","99",,,,,"2","10",,"22","1700","1","1","1","1","37","5","3","2","2","2","6","2","2","2","2","1","1","0","1"
"0.9287288846","0.57315839733","12","12","31","9","436","12026","12","1","1973","401",,"2","2","3","3","1",,,,"1",,,,"2","1","1992","2000","2000","1","2","2","2","0","0","0","0",,"99",,"99",,"99",,"99",,"99",,"99",,,,,,,,,,,,,"3","6",,"73","900","1","1","2","1","30","4","3","2","6","6","4","0","0","0","0","1","0","1","1"
"1.4718046318","0.90831371564","12","12","32","9","436","12026","8","2","1973","436",,"2","2","2","1","7",,,,,,"1",,,"8","1999","1999","2003","4",,"3","2","0","0","0","0",,"99",,"99",,"99",,"99",,"99",,"99",,,,,,,,,,,,,"1","6",,"104","750","99",,,,"30","4","3","5","5","9","3","0","0","0","0","1","0","0","1"
"1.106688183","0.6829847072","12","12","33","9","436","12026","11","2","1977","436",,"1","2","3","2","7",,,,,,"1",,,"8","2002","2002","2002","3",,"2",,"0","0","0","0",,"99",,"99",,"99",,"99",,"99",,"99",,,,,,,,,,,,,,"5",,"16","450","2",,,,"26","3","3","8","8","8","2","0","0","0","0","0","0","0","1"
"0.5144756508","0.31750497305","12","12","34","9","436","12026","8","1","1977","419",,"1","2","3","3","7",,,,,,"1",,,"8","2001","2001","2001","4",,"6","7","0","0","0","0",,"99",,"99",,"99",,"99",,"99",,"99",,,,,,,,,,,,,,"6",,"99","1000","1","2","2","1","26","3","3","7","7","7","4","0","0","0","0","0","0","0","1"
"0.5116218615","0.31574377736","12","12","35","9","436","12026","8","2","1960","401",,"2","2","2","2","2","1",,,,,,,"1","4","1994","1994","1994","2","2","2","9","2","2","2","1","1","20","2","1994",,"99",,"99",,"99",,"99","1","1","99","99",,,,,,,,,"1","3",,,"0","99",,,,"43","6","3","3","3","3","0","2","2","2","1","1","1","0","1"
"0.9864674621","0.60879134802","12","12","36","9","436","12026","3","2","1968","436",,"2","1","2","1","2",,,,,"1",,,"3","1","1996","1996","1997","3","5","2","10","4","1","1","1","1","2","1","99",,"99",,"99",,"99",,"99","2","1","99","99",,,,,,,,,"1","10",,"5","850","2",,,,"35","5","3","4","4","4","4","4","1","1","1","1","1","0","1"
"0.7349652154","0.45357853293","12","12","37","9","436","12026","12","1","1970","460",,"1","2","3","2","2",,,,,"1",,,"3","8","1996","1998","1998","4","1","2",,"0","0","0","0",,"99",,"99",,"99",,"99",,"99",,"99",,,,,,,,,,,,,,"11",,"31","1500","1","1","1","1","33","4","3","4","4","4","5","0","0","0","0","0","0","0","1"
"1.0633693164","0.65625077812","12","12","38","9","436","12026","11","1","1962","460",,"2","2","2","2","1",,"1",,,,,,"3","8","1985","1991","1991","1","1","1","9","1","1","1","1","2","7","1","99",,"99",,"99",,"99",,"99","1","1","99","99",,,,,,,,,"1","10",,"91","2400","99",,,,"41","6","3","1","2","2","6","1","1","1","1","1","1","1","1"
"0.5116218615","0.31574377736","12","12","39","9","436","12026","12","2","1959","602",,"3","1","2","1","3","1",,,,,,,,"4","1983","1991","1991","2","1","2","4","4","0","0","0",,"99",,"99",,"99",,"99",,"99",,"99",,,,,,,,,,,,,"99","3",,,"0","1","3","1","1","44","6","5","1","2","2","0","4","0","0","0","0","0","0","1"
"1.3348974355","0.82382241733","12","12","40","9","436","12118","12","1","1977","436",,"1","2","2","1","7",,,,,,"1",,,"8","2001","2003","2003","1",,"13","1","0","0","0","0",,"99",,"99",,"99",,"99",,"99",,"99",,,,,,,,,,,,,,"6",,"42","800","1","1","2","1","26","3","3","7","9","9","4","0","0","0","0","0","0","0","1"
"0.9198778949","0.56769607228","12","12","41","9","436","12032","9","2","1975","605",,"2","1","3","3","7",,,,,,"1",,,"1","2002","2002","2002","2",,"2","2","0","0","0","0",,"99",,"99",,"99",,"99",,"99",,"99",,,,,,,,,,,,,"1","1",,,"0","1","1","2","1","28","3","5","8","8","8","0","0","0","0","0","1","0","0","1"
"1.1502660471","0.7098784748","12","12","42","9","436","12032","10","1","1961","339",,"1","1","3","3","2","1",,,,,,,"3","3","1986","1993","2002","1","1","2",,"0","0","0","0",,"99",,"99",,"99",,"99",,"99",,"99",,,,,,,,,,,,,,"10",,"103","1300","1","1","2","1","42","6","2","1","3","8","5","0","0","0","0","0","0","0","1"
"1.3348974355","0.82382241733","12","12","43","9","436","12032","13","1","1982","436",,"1","2","2","1","7",,,,,,"1",,,"8","2002","2002","2002","3",,"2",,"0","0","0","0",,"99",,"99",,"99",,"99",,"99",,"99",,,,,,,,,,,,,,"7",,"32","1300","99",,,,"21","2","3","8","8","8","5","0","0","0","0","0","0","0","1"
"0.5116218615","0.31574377736","12","12","44","9","436","12032","12","1","1976","344",,"1","2","2","2","2","1",,,,,,,"2","1","2000","2000","2000","3","2","2",,"0","0","0","0",,"99",,"99",,"99",,"99",,"99",,"99",,,,,,,,,,,,,,"6",,"3","900","1","1","1","1","27","3","2","6","6","6","4","0","0","0","0","0","0","0","1"
"1.1714301112","0.72293972577","12","12","45","9","436","12032","3","1","1968","436",,"2","2","3","3","2",,,,,"1",,,"2","8","1997","1997","1997","3","1","2","9","2","2","2","2","1","4","1","99","2","1","1","99",,"99",,"99","2","1","99","99","2","2","1","99",,,,,"1","6",,"2","1200","1","3","3","1","35","5","3","4","4","4","5","2","2","2","2","1","1","0","1"
"0.6413432815","0.39580042518","12","12","46","9","436","12070","12","1","1967","460",,"2","2","2","2","2",,,,"1",,,,"3","8","1993","1995","1995","4","5","3","2","0","0","0","0",,"99",,"99",,"99",,"99",,"99",,"99",,,,,,,,,,,,,"3","10",,"114","1300","1","1","3","1","36","5","3","3","3","3","5","0","0","0","0","1","0","0","1"
"1.6169234739","0.99787277245","12","12","47","9","436","12070","12","1","1957","235",,"2","3","2","1","7",,,,,,"1",,,"1","1999","1999","1999","4",,"6","12","2","1","1","0",,"99",,"99",,"99",,"99",,"99",,"99",,,,,,,,,,,,,"1","6",,"3","1100","1","1","1","1","46","7","1","5","5","5","5","2","1","1","0","1","1","0","1"
"0.8252662054","0.50930714392","12","12","48","9","436","12070","11","2","1971","305",,"2","2","3","3","2",,,,,"1",,,"2","8","1997","1997","1997","4","1","6",,"2","2","2","2","2","6","99","99","2","2","99","99",,"99",,"99","1","1","99","99","99","2","2","99",,,,,"1","6",,"3","1000","1","1","1","1","32","4","2","4","4","4","4","2","2","2","2","1","1","0","1"
"0.7349652154","0.45357853293","12","12","49","9","436","12070","12","2","1960","515",,"2","1","2","1","3","1",,,,,,,,"1","1992","1992","1992","4","1","2","2","3","3","0","0",,"99",,"99",,"99",,"99",,"99",,"99",,,,,,,,,,,,,"1","6",,"17","775","1","1","2","1","43","6","5","2","2","2","4","3","3","0","0","1","0","0","1"
"1.1477123398","0.70830247256","12","12","50","9","436","12070","11","1","1975","307",,"1","4","4","4","2","1",,,,,,,"4","5","1999","1999","1999","4","2","2","1","0","0","0","0",,"99",,"99",,"99",,"99",,"99",,"99",,,,,,,,,,,,,,"2",,,"0","1","1","1","1","28","3","2","5","5","5","0","0","0","0","0","0","0","0","1"
"1.3964339093","0.86179921257","12","12","51","4","201","12123","12","1","1962","436",,"2","2","2","1","2",,,,"1",,,,"2","8","1991","1992","1992","4","1","2","9","3","3","3","3","2","12","2","1998","1","10","2","1993","1","4","1","99","1","2","2","99","99","1","2","2","2","3","1","2","1","7",,"31","800","1","3","3","3","41","6","3","2","2","2","4","3","3","3","3","1","1","0","1"
"0.5116218615","0.31574377736","12","12","52","4","201","12123","9","1","1965","602",,"2","1","4","3","2","1",,,,,,,"2","1","2000","2000","2000","1","1","2","9","1","1","1","1","2","6","2","2000",,"99",,"99",,"99",,"99","1","1","99","99",,,,,,,,,"1","6",,"22","1600","1","1","1","1","38","5","5","6","6","6","6","1","1","1","1","1","1","0","1"
"0.5116218615","0.31574377736","12","12","53","4","201","12123","9","2","1977","443",,"1","1","4","3","2",,,,,"1",,,"2","1","1997","1997","1998","4","1","2","4","0","0","0","0",,"99",,"99",,"99",,"99",,"99",,"99",,,,,,,,,,,,,,"4",,"105","850","1","1","1","1","26","3","4","4","4","4","4","0","0","0","0","0","0","0","1"
"0.6165421638","0.38049459251","12","12","54","4","201","12123","9","2","1960","605",,"4","1","2","1","3",,,"1",,,,,,"7","1990","1990","1990","1","1","1","1","0","0","0","0",,"99",,"99",,"99",,"99",,"99",,"99",,,,,,,,,,,,,,"4",,"102","99","1","1","1","2","43","6","5","2","2","2","99","0","0","0","0","0","0","0","1"
"0.5116218615","0.31574377736","12","12","55","4","201","12123","9","2","1966","602",,"2","1","3","3","2","1",,,,,,,"1","1","2002","2002","2002","2","1","2","9","1","1","1","1","2","6","2","2002",,"99",,"99",,"99",,"99","1","1","99","99",,,,,,,,,"99","99",,"1","99","1","1","1","3","37","5","5","8","8","8","99","1","1","1","1","1","1","0","1"
"0.8359301574","0.51588832572","12","12","56","4","201","12123","12","2","1973","436",,"2","2","3","2","2","1",,,,,,,"1","4","1996","2000","2002","2","1","2","10","1","1","1","1","2","5","1","99",,"99",,"99",,"99",,"99","1","1","99","99",,,,,,,,,"1","10",,"91","1100","1","1","1","1","30","4","3","4","6","8","5","1","1","1","1","1","1","0","1"
"0.7459324785","0.46034690101","12","12","57","4","201","12123","9","2",,"243",,"2","3","3","2","2",,,,,,"1",,"2","1","1998","2000","2000","1","5","11","1","2","0","0","0",,"99",,"99",,"99",,"99",,"99",,"99",,,,,,,,,,,,,"1","4",,"14","750","1","1","1","2",,,"1","4","6","6","3","2","0","0","0","0","0","0",
"0.6165421638","0.38049459251","12","12","58","4","201","12123","9","2","1958","243",,"4","3","4","3","2",,,,,,"1",,"2","1","1999","2001","2001","4","1","2","2","2","0","0","0",,"99",,"99",,"99",,"99",,"99",,"99",,,,,,,,,,,,,"2","99",,"15","550","1","1","1","3","45","7","1","5","7","7","3","2","0","0","0","1","0","0","1"
"0.5116218615","0.31574377736","12","12","59","4","201","12123","12","2","1973","404",,"1","1","3","2","2",,,,,"1",,,"2","1","1997","1997","1997","4","1","2","2","0","0","0","0",,"99",,"99",,"99",,"99",,"99",,"99",,,,,,,,,,,,,"1","4",,"18","1000","1","1","1","2","30","4","4","4","4","4","4","0","0","0","0","1","0","0","1"
"2.4679146724","1.52305591211","12","12","60","4","201","12123","13","2","1988","201","6","2","7","4","5","1",,,,"1",,,,"2","8","1994","1997","1997","1","1","2","9","1","1","1","1","2","5","1","99",,"99",,"99",,"99",,"99","1","1","99","99",,,,,,,,,"1","6",,"105","1200","1","1","1","1","15","1","1","3","4","4","5","1","1","1","1","1","1","1","3"
"1.5573536846","0.96110970248","12","12","61","4","201","12123","3","1","1983","201","7","1","7","2","2","2","1",,,,,,,"2","8","2000","2000","2000","3","1","2","4","0","0","0","0",,"99",,"99",,"99",,"99",,"99",,"99",,,,,,,,,,,,,,"6",,"1","900","1","1","1","1","20","2","1","6","6","6","4","0","0","0","0","0","0","0","1"
"2.1569496742","1.33114608466","12","12","62","4","201","12123","13","2","1971","201","13","2","7","4","99","2","1",,,,,,,"1","4","2000","2000","2000","2","1","2","3","0","0","0","0",,"99",,"99",,"99",,"99",,"99",,"99",,,,,,,,,,,,,"1","4",,"104","750","1","1","1","2","32","4","1","6","6","6","3","0","0","0","0","1","0","0","1"
"1.6726970049","1.03229300874","12","12","63","4","201","12123","13","1","1958","201","13","2","3","3","3","2",,,,"1",,,,"2","8","1995","1995","2000","3","1","2","9","2","2","2","1","1","15","2","99",,"99",,"99",,"99",,"99","1","2","99","99",,,,,,,,,"1","6",,"112","1500","1","1","1","2","45","7","1","3","3","6","5","2","2","2","1","1","1","0","1"
"1.5434269523","0.95251491916","12","12","64","4","201","12123","12","1","1947","201","7","2","7","3","3","2",,,"1",,,,,"2","8","1991","1996","1996","1","1","6","7","2","0","0","0",,"99",,"99",,"99",,"99",,"99",,"99",,,,,,,,,,,,,"1","6",,"5","900","1","1","1","1","56","9","1","2","4","4","4","2","0","0","0","0","0","0","1"
"1.8948282394","1.16937971346","12","12","65","4","201","12123","3","1","1972","201","3","2","7","4","99","1",,,,"1",,,,"2","8","1992","1995","1995","1","1","1","9","1","1","1","1","2","5","1","99",,"99",,"99",,"99",,"99","1","1","99","99",,,,,,,,,"1","6",,"22","1400","1","1","1","2","31","4","1","2","3","3","5","1","1","1","1","1","1","1","1"
"0.5116218615","0.31574377736","12","12","66","4","201","12123","12","1","1962","404",,"2","1","3","3","2",,,,"1",,,,"2","1","1995","1995","1995","4","1","2","9","2","2","1","1","2","14","2","2002",,"99",,"99",,"99",,"99","1","2","99","99",,,,,,,,,"1","6",,"1","900","1","1","1","3","41","6","4","3","3","3","4","2","2","1","1","1","1","0","1"
"1.1807220279","0.7286741658","12","12","67","4","201","12123","9","1","1970","406",,"2","2","4","5","2",,,,,"1",,,"2","7","1997","1999","1999","1","2","2","4","3","0","0","0",,"99",,"99",,"99",,"99",,"99",,"99",,,,,,,,,,,,,"1","6",,"62","1000","1","1","1","3","33","4","4","4","5","5","4","3","0","0","0","0","0","0","1"
"0.5116218615","0.31574377736","12","12","68","4","201","12123","11","2","1972","450",,"4","2","2","2","7",,,,,,"1",,,"8","2000","2000","2000","4",,"1","2","4","0","0","0",,"99",,"99",,"99",,"99",,"99",,"99",,,,,,,,,,,,,"1","1",,,"0","1","1","1","3","31","4","4","6","6","6","0","4","0","0","0","1","0","0","1"
"2.4679146724","1.52305591211","12","12","69","4","201","12123","13","2","1970","201","13","2","99","4","5","1",,,,"1",,,,"2","1","1993","1993","1993","2","1","2","9","2","2","2","2","1","8","1","99","1","3","1","99",,"99",,"99","1","1","99","99","99","99","99","99",,,,,"1","6",,"81","1000","1","1","1","1","33","4","1","3","3","3","4","2","2","2","2","1","1","1","1"
"0.6050723117","0.37341605523","12","12","70","4","201","12123","9","2","1966","615",,"2","1","3","3","2","1",,,,,,,"2","3","1996","1996","1996","4","1","2","9","2","2","2","2","1","10","2","2002","2","1","1","99",,"99",,"99","1","1","99","99","99","99","99","99",,,,,"1","6",,"16","900","1","1","1","2","37","5","5","4","4","4","4","2","2","2","2","1","1","0","1"